Uploaded image for project: 'WildFly Core'
  1. WildFly Core
  2. WFCORE-4213

CLIAuthenticationTestCase fails with Elytron profile in Testsuite

    Details

      Description

      cd testsuite/manualmode/
      mvn test -Delytron -Dtest=CLIAuthenticationTestCase

      [INFO] Running org.jboss.as.test.manualmode.management.cli.CLIAuthenticationTestCase
      [ERROR] Tests run: 3, Failures: 0, Errors: 3, Skipped: 0, Time elapsed: 34.361 s <<< FAILURE! - in org.jboss.as.test.manualmode.management.cli.CLIAuthenticationTestCase
      [ERROR] testSaslAuth(org.jboss.as.test.manualmode.management.cli.CLIAuthenticationTestCase)  Time elapsed: 21.797 s  <<< ERROR!
      java.lang.Exception: 
      ry-name=test-sasl-factory --new-security-domain-name=test-sasl-security-domainile-system-realm-name=fs-test-realm --new-auth-facto 
      Server reloaded.
      Command success.
      Authentication configured for management http-interface
      sasl authentication-factory=management-sasl-authentication
      security-domain=ManagementDomain
      [standalone@127.0.0.1:9990 /] 
      [standalone@127.0.0.1:9990 /] 
      	at org.jboss.as.test.manualmode.management.cli.CLIAuthenticationTestCase.testSaslAuth(CLIAuthenticationTestCase.java:298)
      	at sun.reflect.NativeMethodAccessorImpl.invoke0(Native Method)
      	at sun.reflect.NativeMethodAccessorImpl.invoke(NativeMethodAccessorImpl.java:62)
      	at sun.reflect.DelegatingMethodAccessorImpl.invoke(DelegatingMethodAccessorImpl.java:43)
      	at java.lang.reflect.Method.invoke(Method.java:498)
      	at org.junit.runners.model.FrameworkMethod$1.runReflectiveCall(FrameworkMethod.java:50)
      	at org.junit.internal.runners.model.ReflectiveCallable.run(ReflectiveCallable.java:12)
      	at org.junit.runners.model.FrameworkMethod.invokeExplosively(FrameworkMethod.java:47)
      	at org.junit.internal.runners.statements.InvokeMethod.evaluate(InvokeMethod.java:17)
      	at org.junit.runners.ParentRunner.runLeaf(ParentRunner.java:325)
      	at org.junit.runners.BlockJUnit4ClassRunner.runChild(BlockJUnit4ClassRunner.java:78)
      	at org.junit.runners.BlockJUnit4ClassRunner.runChild(BlockJUnit4ClassRunner.java:57)
      	at org.junit.runners.ParentRunner$3.run(ParentRunner.java:290)
      	at org.junit.runners.ParentRunner$1.schedule(ParentRunner.java:71)
      	at org.junit.runners.ParentRunner.runChildren(ParentRunner.java:288)
      	at org.junit.runners.ParentRunner.access$000(ParentRunner.java:58)
      	at org.junit.runners.ParentRunner$2.evaluate(ParentRunner.java:268)
      	at org.junit.internal.runners.statements.RunBefores.evaluate(RunBefores.java:26)
      	at org.junit.internal.runners.statements.RunAfters.evaluate(RunAfters.java:27)
      	at org.junit.rules.ExternalResource$1.evaluate(ExternalResource.java:48)
      	at org.junit.rules.RunRules.evaluate(RunRules.java:20)
      	at org.junit.runners.ParentRunner.run(ParentRunner.java:363)
      	at org.wildfly.core.testrunner.WildflyTestRunner.run(WildflyTestRunner.java:109)
      	at org.junit.runners.Suite.runChild(Suite.java:128)
      	at org.junit.runners.Suite.runChild(Suite.java:27)
      	at org.junit.runners.ParentRunner$3.run(ParentRunner.java:290)
      	at org.junit.runners.ParentRunner$1.schedule(ParentRunner.java:71)
      	at org.junit.runners.ParentRunner.runChildren(ParentRunner.java:288)
      	at org.junit.runners.ParentRunner.access$000(ParentRunner.java:58)
      	at org.junit.runners.ParentRunner$2.evaluate(ParentRunner.java:268)
      	at org.junit.runners.ParentRunner.run(ParentRunner.java:363)
      	at org.apache.maven.surefire.junitcore.JUnitCore.run(JUnitCore.java:55)
      	at org.apache.maven.surefire.junitcore.JUnitCoreWrapper.createRequestAndRun(JUnitCoreWrapper.java:137)
      	at org.apache.maven.surefire.junitcore.JUnitCoreWrapper.executeEager(JUnitCoreWrapper.java:107)
      	at org.apache.maven.surefire.junitcore.JUnitCoreWrapper.execute(JUnitCoreWrapper.java:83)
      	at org.apache.maven.surefire.junitcore.JUnitCoreWrapper.execute(JUnitCoreWrapper.java:75)
      	at org.apache.maven.surefire.junitcore.JUnitCoreProvider.invoke(JUnitCoreProvider.java:158)
      	at org.apache.maven.surefire.booter.ForkedBooter.invokeProviderInSameClassLoader(ForkedBooter.java:383)
      	at org.apache.maven.surefire.booter.ForkedBooter.runSuitesInProcess(ForkedBooter.java:344)
      	at org.apache.maven.surefire.booter.ForkedBooter.execute(ForkedBooter.java:125)
      	at org.apache.maven.surefire.booter.ForkedBooter.main(ForkedBooter.java:417)
      Caused by: java.lang.AssertionError
      	at org.junit.Assert.fail(Assert.java:86)
      	at org.junit.Assert.assertTrue(Assert.java:41)
      	at org.junit.Assert.assertTrue(Assert.java:52)
      	at org.jboss.as.test.manualmode.management.cli.CLIAuthenticationTestCase.testSaslAuth(CLIAuthenticationTestCase.java:262)
      	... 40 more
      
      [ERROR] testHttpAuth(org.jboss.as.test.manualmode.management.cli.CLIAuthenticationTestCase)  Time elapsed: 2.194 s  <<< ERROR!
      org.wildfly.core.testrunner.UnsuccessfulOperationException: 
      "WFLYCTL0367: Cannot remove capability 'org.wildfly.security.realm-mapper.fs-test-realm' as it is required by other capabilities:
      capability 'org.wildfly.security.sasl-authentication-factory.management-sasl-authentication' requires it for attribute 'realm-mapper' at address '/subsystem=elytron/sasl-authentication-factory=management-sasl-authentication'"
      	at org.wildfly.core.testrunner.ManagementClient.checkSuccessful(ManagementClient.java:247)
      	at org.wildfly.core.testrunner.ManagementClient.executeForResult(ManagementClient.java:235)
      	at org.jboss.as.test.manualmode.management.cli.CLIAuthenticationTestCase.cleanTest(CLIAuthenticationTestCase.java:169)
      	at org.jboss.as.test.manualmode.management.cli.CLIAuthenticationTestCase.testHttpAuth(CLIAuthenticationTestCase.java:228)
      	at sun.reflect.NativeMethodAccessorImpl.invoke0(Native Method)
      	at sun.reflect.NativeMethodAccessorImpl.invoke(NativeMethodAccessorImpl.java:62)
      	at sun.reflect.DelegatingMethodAccessorImpl.invoke(DelegatingMethodAccessorImpl.java:43)
      	at java.lang.reflect.Method.invoke(Method.java:498)
      	at org.junit.runners.model.FrameworkMethod$1.runReflectiveCall(FrameworkMethod.java:50)
      	at org.junit.internal.runners.model.ReflectiveCallable.run(ReflectiveCallable.java:12)
      	at org.junit.runners.model.FrameworkMethod.invokeExplosively(FrameworkMethod.java:47)
      	at org.junit.internal.runners.statements.InvokeMethod.evaluate(InvokeMethod.java:17)
      	at org.junit.runners.ParentRunner.runLeaf(ParentRunner.java:325)
      	at org.junit.runners.BlockJUnit4ClassRunner.runChild(BlockJUnit4ClassRunner.java:78)
      	at org.junit.runners.BlockJUnit4ClassRunner.runChild(BlockJUnit4ClassRunner.java:57)
      	at org.junit.runners.ParentRunner$3.run(ParentRunner.java:290)
      	at org.junit.runners.ParentRunner$1.schedule(ParentRunner.java:71)
      	at org.junit.runners.ParentRunner.runChildren(ParentRunner.java:288)
      	at org.junit.runners.ParentRunner.access$000(ParentRunner.java:58)
      	at org.junit.runners.ParentRunner$2.evaluate(ParentRunner.java:268)
      	at org.junit.internal.runners.statements.RunBefores.evaluate(RunBefores.java:26)
      	at org.junit.internal.runners.statements.RunAfters.evaluate(RunAfters.java:27)
      	at org.junit.rules.ExternalResource$1.evaluate(ExternalResource.java:48)
      	at org.junit.rules.RunRules.evaluate(RunRules.java:20)
      	at org.junit.runners.ParentRunner.run(ParentRunner.java:363)
      	at org.wildfly.core.testrunner.WildflyTestRunner.run(WildflyTestRunner.java:109)
      	at org.junit.runners.Suite.runChild(Suite.java:128)
      	at org.junit.runners.Suite.runChild(Suite.java:27)
      	at org.junit.runners.ParentRunner$3.run(ParentRunner.java:290)
      	at org.junit.runners.ParentRunner$1.schedule(ParentRunner.java:71)
      	at org.junit.runners.ParentRunner.runChildren(ParentRunner.java:288)
      	at org.junit.runners.ParentRunner.access$000(ParentRunner.java:58)
      	at org.junit.runners.ParentRunner$2.evaluate(ParentRunner.java:268)
      	at org.junit.runners.ParentRunner.run(ParentRunner.java:363)
      	at org.apache.maven.surefire.junitcore.JUnitCore.run(JUnitCore.java:55)
      	at org.apache.maven.surefire.junitcore.JUnitCoreWrapper.createRequestAndRun(JUnitCoreWrapper.java:137)
      	at org.apache.maven.surefire.junitcore.JUnitCoreWrapper.executeEager(JUnitCoreWrapper.java:107)
      	at org.apache.maven.surefire.junitcore.JUnitCoreWrapper.execute(JUnitCoreWrapper.java:83)
      	at org.apache.maven.surefire.junitcore.JUnitCoreWrapper.execute(JUnitCoreWrapper.java:75)
      	at org.apache.maven.surefire.junitcore.JUnitCoreProvider.invoke(JUnitCoreProvider.java:158)
      	at org.apache.maven.surefire.booter.ForkedBooter.invokeProviderInSameClassLoader(ForkedBooter.java:383)
      	at org.apache.maven.surefire.booter.ForkedBooter.runSuitesInProcess(ForkedBooter.java:344)
      	at org.apache.maven.surefire.booter.ForkedBooter.execute(ForkedBooter.java:125)
      	at org.apache.maven.surefire.booter.ForkedBooter.main(ForkedBooter.java:417)
      
      [ERROR] org.jboss.as.test.manualmode.management.cli.CLIAuthenticationTestCase  Time elapsed: 12.56 s  <<< ERROR!
      org.wildfly.core.testrunner.UnsuccessfulOperationException: 
      "WFLYCTL0367: Cannot remove capability 'org.wildfly.security.security-realm.fs-test-realm' as it is required by other capabilities:
      capability 'org.wildfly.security.security-domain.ManagementDomain' requires it for attribute 'realm' at address '/subsystem=elytron/security-domain=ManagementDomain'"
      	at org.wildfly.core.testrunner.ManagementClient.checkSuccessful(ManagementClient.java:247)
      	at org.wildfly.core.testrunner.ManagementClient.executeForResult(ManagementClient.java:235)
      	at org.jboss.as.test.manualmode.management.cli.CLIAuthenticationTestCase.cleanConfig(CLIAuthenticationTestCase.java:136)
      	at org.jboss.as.test.manualmode.management.cli.CLIAuthenticationTestCase.afterClass(CLIAuthenticationTestCase.java:98)
      	at sun.reflect.NativeMethodAccessorImpl.invoke0(Native Method)
      	at sun.reflect.NativeMethodAccessorImpl.invoke(NativeMethodAccessorImpl.java:62)
      	at sun.reflect.DelegatingMethodAccessorImpl.invoke(DelegatingMethodAccessorImpl.java:43)
      	at java.lang.reflect.Method.invoke(Method.java:498)
      	at org.junit.runners.model.FrameworkMethod$1.runReflectiveCall(FrameworkMethod.java:50)
      	at org.junit.internal.runners.model.ReflectiveCallable.run(ReflectiveCallable.java:12)
      	at org.junit.runners.model.FrameworkMethod.invokeExplosively(FrameworkMethod.java:47)
      	at org.junit.internal.runners.statements.RunAfters.evaluate(RunAfters.java:33)
      	at org.junit.rules.ExternalResource$1.evaluate(ExternalResource.java:48)
      	at org.junit.rules.RunRules.evaluate(RunRules.java:20)
      	at org.junit.runners.ParentRunner.run(ParentRunner.java:363)
      	at org.wildfly.core.testrunner.WildflyTestRunner.run(WildflyTestRunner.java:109)
      	at org.junit.runners.Suite.runChild(Suite.java:128)
      	at org.junit.runners.Suite.runChild(Suite.java:27)
      	at org.junit.runners.ParentRunner$3.run(ParentRunner.java:290)
      	at org.junit.runners.ParentRunner$1.schedule(ParentRunner.java:71)
      	at org.junit.runners.ParentRunner.runChildren(ParentRunner.java:288)
      	at org.junit.runners.ParentRunner.access$000(ParentRunner.java:58)
      	at org.junit.runners.ParentRunner$2.evaluate(ParentRunner.java:268)
      	at org.junit.runners.ParentRunner.run(ParentRunner.java:363)
      	at org.apache.maven.surefire.junitcore.JUnitCore.run(JUnitCore.java:55)
      	at org.apache.maven.surefire.junitcore.JUnitCoreWrapper.createRequestAndRun(JUnitCoreWrapper.java:137)
      	at org.apache.maven.surefire.junitcore.JUnitCoreWrapper.executeEager(JUnitCoreWrapper.java:107)
      	at org.apache.maven.surefire.junitcore.JUnitCoreWrapper.execute(JUnitCoreWrapper.java:83)
      	at org.apache.maven.surefire.junitcore.JUnitCoreWrapper.execute(JUnitCoreWrapper.java:75)
      	at org.apache.maven.surefire.junitcore.JUnitCoreProvider.invoke(JUnitCoreProvider.java:158)
      	at org.apache.maven.surefire.booter.ForkedBooter.invokeProviderInSameClassLoader(ForkedBooter.java:383)
      	at org.apache.maven.surefire.booter.ForkedBooter.runSuitesInProcess(ForkedBooter.java:344)
      	at org.apache.maven.surefire.booter.ForkedBooter.execute(ForkedBooter.java:125)
      	at org.apache.maven.surefire.booter.ForkedBooter.main(ForkedBooter.java:417)
      
      [INFO] 
      [INFO] Results:
      [INFO] 
      [ERROR] Errors: 
      [ERROR]   CLIAuthenticationTestCase.afterClass:98->cleanConfig:136 » UnsuccessfulOperation
      [ERROR]   CLIAuthenticationTestCase.testHttpAuth:228->cleanTest:169 » UnsuccessfulOperation
      [ERROR]   CLIAuthenticationTestCase.testSaslAuth:298  security enable-sasl-management --...
      [INFO] 
      [ERROR] Tests run: 3, Failures: 0, Errors: 3, Skipped: 0
      [INFO] 
      [INFO] ------------------------------------------------------------------------
      [INFO] BUILD FAILURE
      
      

        Gliffy Diagrams

          Attachments

            Issue Links

              Activity

                People

                • Assignee:
                  jdenise Jean Francois Denise
                  Reporter:
                  mchoma Martin Choma
                • Votes:
                  0 Vote for this issue
                  Watchers:
                  1 Start watching this issue

                  Dates

                  • Created:
                    Updated:
                    Resolved: