Details

      Description

      Latest merges on the master branch introduced test failures in ArjunaJTS integration module.

      
      [INFO] 
      [INFO] Results:
      [INFO] 
      [ERROR] Errors: 
      [ERROR]   TransactionListenerRegistryTest.test:137 ? NotSupported BaseTransaction.checkT...
      [ERROR]   TransactionListenerRegistryTest.testIllegalCommit:96->runTxn:86 ? IllegalState
      [ERROR]   TransactionListenerRegistryTest.testIllegalRollback:109->runTxn:86 ? IllegalState
      [ERROR]   TransactionListenerRegistryTest.testLifecycle:121->runTxn:86 ? IllegalState Tr...
      [ERROR]   SPIUnitTest.testListener:154 Runtime TransactionListenerRegistry test failure:...
      
      

      CI job: http://narayanaci1.eng.hst.ams2.redhat.com/job/narayana/PROFILE=MAIN,jdk=jdk8.latest,label=linux/463/console

        Gliffy Diagrams

          Attachments

            Activity

              People

              • Assignee:
                ochaloup Ondrej Chaloupka
                Reporter:
                mstefank Martin Stefanko
              • Votes:
                0 Vote for this issue
                Watchers:
                2 Start watching this issue

                Dates

                • Created:
                  Updated:
                  Resolved: