Details

    • Type: Task
    • Status: Closed (View Workflow)
    • Priority: Major
    • Resolution: Done
    • Affects Version/s: None
    • Fix Version/s: 5.9.1.Final
    • Component/s: LRA
    • Labels:
      None

      Description

      We have a test that fails fairly regulary due to timeout:

      Tests run: 26, Failures: 1, Errors: 0, Skipped: 1, Time elapsed: 98.564 sec <<< FAILURE! - in io.narayana.lra.participant.SpecIT
      timeLimitRequiredLRA(io.narayana.lra.participant.SpecIT) Time elapsed: 0.868 sec <<< FAILURE!
      java.lang.AssertionError: timeLimitRequiredLRA: compensate should have been called expected:<1> but was:<0>
      at io.narayana.lra.participant.SpecIT.timeLimitRequiredLRA(SpecIT.java:608)

      Results :

      Failed tests:
      SpecIT.timeLimitRequiredLRA:608 timeLimitRequiredLRA: compensate should have been called expected:<1> but was:<0>

        Gliffy Diagrams

          Attachments

            Activity

              People

              • Assignee:
                mmusgrov Michael Musgrove
                Reporter:
                tomjenkinson Thomas Jenkinson
              • Votes:
                0 Vote for this issue
                Watchers:
                1 Start watching this issue

                Dates

                • Created:
                  Updated:
                  Resolved: