Uploaded image for project: 'JBoss Transaction Manager'
  1. JBoss Transaction Manager
  2. JBTM-1967

org.jboss.jbossts.xts.bytemanSupport.BMScript fails to submit/remove rules on remote container

    Details

    • Type: Bug
    • Status: Closed (View Workflow)
    • Priority: Minor
    • Resolution: Out of Date
    • Affects Version/s: None
    • Fix Version/s: None
    • Component/s: XTS
    • Labels:
      None
    • Steps to Reproduce:
      Hide

      Gytis Trikleris

      Show
      Gytis Trikleris

      Description

      TXFramework tests fail to add and remove byteman script to/from remote server.

      Here is the output after executing the following line:

      mvn clean test -Dtest=CompensatableTest#testDefaultNoExistingTX -Parq-remote
      Running org.jboss.narayana.compensations.functional.compensatable.CompensatableTest
      Tests run: 2, Failures: 0, Errors: 2, Skipped: 0, Time elapsed: 6.167 sec <<< FAILURE!
      org.jboss.narayana.compensations.functional.compensatable.CompensatableTest  Time elapsed: 6.166 sec  <<< ERROR!
      java.lang.RuntimeException: Failed to submit Byteman script
      	at org.jboss.jbossts.xts.bytemanSupport.BMScript.submit(BMScript.java:24)
      	at org.jboss.narayana.compensations.functional.compensatable.CompensatableTest.submitBytemanScript(CompensatableTest.java:86)
      	at sun.reflect.NativeMethodAccessorImpl.invoke0(Native Method)
      	at sun.reflect.NativeMethodAccessorImpl.invoke(NativeMethodAccessorImpl.java:57)
      	at sun.reflect.DelegatingMethodAccessorImpl.invoke(DelegatingMethodAccessorImpl.java:43)
      	at java.lang.reflect.Method.invoke(Method.java:606)
      	at org.junit.runners.model.FrameworkMethod$1.runReflectiveCall(FrameworkMethod.java:45)
      	at org.junit.internal.runners.model.ReflectiveCallable.run(ReflectiveCallable.java:15)
      	at org.junit.runners.model.FrameworkMethod.invokeExplosively(FrameworkMethod.java:42)
      	at org.junit.internal.runners.statements.RunBefores.evaluate(RunBefores.java:27)
      	at org.jboss.arquillian.junit.Arquillian$StatementLifecycleExecutor.invoke(Arquillian.java:351)
      	at org.jboss.arquillian.container.test.impl.execution.ClientBeforeAfterLifecycleEventExecuter.execute(ClientBeforeAfterLifecycleEventExecuter.java:99)
      	at org.jboss.arquillian.container.test.impl.execution.ClientBeforeAfterLifecycleEventExecuter.on(ClientBeforeAfterLifecycleEventExecuter.java:60)
      	at sun.reflect.NativeMethodAccessorImpl.invoke0(Native Method)
      	at sun.reflect.NativeMethodAccessorImpl.invoke(NativeMethodAccessorImpl.java:57)
      	at sun.reflect.DelegatingMethodAccessorImpl.invoke(DelegatingMethodAccessorImpl.java:43)
      	at java.lang.reflect.Method.invoke(Method.java:606)
      	at org.jboss.arquillian.core.impl.ObserverImpl.invoke(ObserverImpl.java:94)
      	at org.jboss.arquillian.core.impl.EventContextImpl.invokeObservers(EventContextImpl.java:99)
      	at org.jboss.arquillian.core.impl.EventContextImpl.proceed(EventContextImpl.java:81)
      	at org.jboss.arquillian.test.impl.TestContextHandler.createClassContext(TestContextHandler.java:75)
      	at sun.reflect.NativeMethodAccessorImpl.invoke0(Native Method)
      	at sun.reflect.NativeMethodAccessorImpl.invoke(NativeMethodAccessorImpl.java:57)
      	at sun.reflect.DelegatingMethodAccessorImpl.invoke(DelegatingMethodAccessorImpl.java:43)
      	at java.lang.reflect.Method.invoke(Method.java:606)
      	at org.jboss.arquillian.core.impl.ObserverImpl.invoke(ObserverImpl.java:94)
      	at org.jboss.arquillian.core.impl.EventContextImpl.proceed(EventContextImpl.java:88)
      	at org.jboss.arquillian.test.impl.TestContextHandler.createSuiteContext(TestContextHandler.java:60)
      	at sun.reflect.NativeMethodAccessorImpl.invoke0(Native Method)
      	at sun.reflect.NativeMethodAccessorImpl.invoke(NativeMethodAccessorImpl.java:57)
      	at sun.reflect.DelegatingMethodAccessorImpl.invoke(DelegatingMethodAccessorImpl.java:43)
      	at java.lang.reflect.Method.invoke(Method.java:606)
      	at org.jboss.arquillian.core.impl.ObserverImpl.invoke(ObserverImpl.java:94)
      	at org.jboss.arquillian.core.impl.EventContextImpl.proceed(EventContextImpl.java:88)
      	at org.jboss.arquillian.core.impl.ManagerImpl.fire(ManagerImpl.java:135)
      	at org.jboss.arquillian.core.impl.ManagerImpl.fire(ManagerImpl.java:115)
      	at org.jboss.arquillian.test.impl.EventTestRunnerAdaptor.beforeClass(EventTestRunnerAdaptor.java:80)
      	at org.jboss.arquillian.junit.Arquillian$2.evaluate(Arquillian.java:182)
      	at org.jboss.arquillian.junit.Arquillian.multiExecute(Arquillian.java:314)
      	at org.jboss.arquillian.junit.Arquillian.access$100(Arquillian.java:46)
      	at org.jboss.arquillian.junit.Arquillian$3.evaluate(Arquillian.java:199)
      	at org.junit.runners.ParentRunner.run(ParentRunner.java:300)
      	at org.jboss.arquillian.junit.Arquillian.run(Arquillian.java:147)
      	at org.apache.maven.surefire.junit4.JUnit4Provider.execute(JUnit4Provider.java:242)
      	at org.apache.maven.surefire.junit4.JUnit4Provider.executeTestSet(JUnit4Provider.java:137)
      	at org.apache.maven.surefire.junit4.JUnit4Provider.invoke(JUnit4Provider.java:112)
      	at sun.reflect.NativeMethodAccessorImpl.invoke0(Native Method)
      	at sun.reflect.NativeMethodAccessorImpl.invoke(NativeMethodAccessorImpl.java:57)
      	at sun.reflect.DelegatingMethodAccessorImpl.invoke(DelegatingMethodAccessorImpl.java:43)
      	at java.lang.reflect.Method.invoke(Method.java:606)
      	at org.apache.maven.surefire.util.ReflectionUtils.invokeMethodWithArray(ReflectionUtils.java:189)
      	at org.apache.maven.surefire.booter.ProviderFactory$ProviderProxy.invoke(ProviderFactory.java:165)
      	at org.apache.maven.surefire.booter.ProviderFactory.invokeProvider(ProviderFactory.java:85)
      	at org.apache.maven.surefire.booter.ForkedBooter.runSuitesInProcess(ForkedBooter.java:115)
      	at org.apache.maven.surefire.booter.ForkedBooter.main(ForkedBooter.java:75)
      Caused by: java.net.ConnectException: Connection refused
      	at java.net.PlainSocketImpl.socketConnect(Native Method)
      	at java.net.AbstractPlainSocketImpl.doConnect(AbstractPlainSocketImpl.java:339)
      	at java.net.AbstractPlainSocketImpl.connectToAddress(AbstractPlainSocketImpl.java:200)
      	at java.net.AbstractPlainSocketImpl.connect(AbstractPlainSocketImpl.java:182)
      	at java.net.SocksSocketImpl.connect(SocksSocketImpl.java:392)
      	at java.net.Socket.connect(Socket.java:579)
      	at java.net.Socket.connect(Socket.java:528)
      	at java.net.Socket.<init>(Socket.java:425)
      	at java.net.Socket.<init>(Socket.java:208)
      	at org.jboss.byteman.agent.submit.Submit$Comm.<init>(Submit.java:871)
      	at org.jboss.byteman.agent.submit.Submit.submitRequest(Submit.java:777)
      	at org.jboss.byteman.agent.submit.Submit.addScripts(Submit.java:595)
      	at org.jboss.byteman.agent.submit.Submit.addRulesFromResources(Submit.java:568)
      	at org.jboss.jbossts.xts.bytemanSupport.BMScript.submit(BMScript.java:22)
      	... 54 more
      
      org.jboss.narayana.compensations.functional.compensatable.CompensatableTest  Time elapsed: 6.167 sec  <<< ERROR!
      java.lang.RuntimeException: Failed to remove Byteman script
      	at org.jboss.jbossts.xts.bytemanSupport.BMScript.remove(BMScript.java:34)
      	at org.jboss.narayana.compensations.functional.compensatable.CompensatableTest.removeBytemanScript(CompensatableTest.java:91)
      	at sun.reflect.NativeMethodAccessorImpl.invoke0(Native Method)
      	at sun.reflect.NativeMethodAccessorImpl.invoke(NativeMethodAccessorImpl.java:57)
      	at sun.reflect.DelegatingMethodAccessorImpl.invoke(DelegatingMethodAccessorImpl.java:43)
      	at java.lang.reflect.Method.invoke(Method.java:606)
      	at org.junit.runners.model.FrameworkMethod$1.runReflectiveCall(FrameworkMethod.java:45)
      	at org.junit.internal.runners.model.ReflectiveCallable.run(ReflectiveCallable.java:15)
      	at org.junit.runners.model.FrameworkMethod.invokeExplosively(FrameworkMethod.java:42)
      	at org.junit.internal.runners.statements.RunAfters.evaluate(RunAfters.java:36)
      	at org.jboss.arquillian.junit.Arquillian$StatementLifecycleExecutor.invoke(Arquillian.java:351)
      	at org.jboss.arquillian.container.test.impl.execution.ClientBeforeAfterLifecycleEventExecuter.execute(ClientBeforeAfterLifecycleEventExecuter.java:99)
      	at org.jboss.arquillian.container.test.impl.execution.ClientBeforeAfterLifecycleEventExecuter.on(ClientBeforeAfterLifecycleEventExecuter.java:65)
      	at sun.reflect.NativeMethodAccessorImpl.invoke0(Native Method)
      	at sun.reflect.NativeMethodAccessorImpl.invoke(NativeMethodAccessorImpl.java:57)
      	at sun.reflect.DelegatingMethodAccessorImpl.invoke(DelegatingMethodAccessorImpl.java:43)
      	at java.lang.reflect.Method.invoke(Method.java:606)
      	at org.jboss.arquillian.core.impl.ObserverImpl.invoke(ObserverImpl.java:94)
      	at org.jboss.arquillian.core.impl.EventContextImpl.invokeObservers(EventContextImpl.java:99)
      	at org.jboss.arquillian.core.impl.EventContextImpl.proceed(EventContextImpl.java:81)
      	at org.jboss.arquillian.test.impl.TestContextHandler.createClassContext(TestContextHandler.java:75)
      	at sun.reflect.NativeMethodAccessorImpl.invoke0(Native Method)
      	at sun.reflect.NativeMethodAccessorImpl.invoke(NativeMethodAccessorImpl.java:57)
      	at sun.reflect.DelegatingMethodAccessorImpl.invoke(DelegatingMethodAccessorImpl.java:43)
      	at java.lang.reflect.Method.invoke(Method.java:606)
      	at org.jboss.arquillian.core.impl.ObserverImpl.invoke(ObserverImpl.java:94)
      	at org.jboss.arquillian.core.impl.EventContextImpl.proceed(EventContextImpl.java:88)
      	at org.jboss.arquillian.test.impl.TestContextHandler.createSuiteContext(TestContextHandler.java:60)
      	at sun.reflect.NativeMethodAccessorImpl.invoke0(Native Method)
      	at sun.reflect.NativeMethodAccessorImpl.invoke(NativeMethodAccessorImpl.java:57)
      	at sun.reflect.DelegatingMethodAccessorImpl.invoke(DelegatingMethodAccessorImpl.java:43)
      	at java.lang.reflect.Method.invoke(Method.java:606)
      	at org.jboss.arquillian.core.impl.ObserverImpl.invoke(ObserverImpl.java:94)
      	at org.jboss.arquillian.core.impl.EventContextImpl.proceed(EventContextImpl.java:88)
      	at org.jboss.arquillian.core.impl.ManagerImpl.fire(ManagerImpl.java:135)
      	at org.jboss.arquillian.core.impl.ManagerImpl.fire(ManagerImpl.java:115)
      	at org.jboss.arquillian.test.impl.EventTestRunnerAdaptor.afterClass(EventTestRunnerAdaptor.java:87)
      	at org.jboss.arquillian.junit.Arquillian$3$1.evaluate(Arquillian.java:204)
      	at org.jboss.arquillian.junit.Arquillian.multiExecute(Arquillian.java:314)
      	at org.jboss.arquillian.junit.Arquillian.access$100(Arquillian.java:46)
      	at org.jboss.arquillian.junit.Arquillian$3.evaluate(Arquillian.java:199)
      	at org.junit.runners.ParentRunner.run(ParentRunner.java:300)
      	at org.jboss.arquillian.junit.Arquillian.run(Arquillian.java:147)
      	at org.apache.maven.surefire.junit4.JUnit4Provider.execute(JUnit4Provider.java:242)
      	at org.apache.maven.surefire.junit4.JUnit4Provider.executeTestSet(JUnit4Provider.java:137)
      	at org.apache.maven.surefire.junit4.JUnit4Provider.invoke(JUnit4Provider.java:112)
      	at sun.reflect.NativeMethodAccessorImpl.invoke0(Native Method)
      	at sun.reflect.NativeMethodAccessorImpl.invoke(NativeMethodAccessorImpl.java:57)
      	at sun.reflect.DelegatingMethodAccessorImpl.invoke(DelegatingMethodAccessorImpl.java:43)
      	at java.lang.reflect.Method.invoke(Method.java:606)
      	at org.apache.maven.surefire.util.ReflectionUtils.invokeMethodWithArray(ReflectionUtils.java:189)
      	at org.apache.maven.surefire.booter.ProviderFactory$ProviderProxy.invoke(ProviderFactory.java:165)
      	at org.apache.maven.surefire.booter.ProviderFactory.invokeProvider(ProviderFactory.java:85)
      	at org.apache.maven.surefire.booter.ForkedBooter.runSuitesInProcess(ForkedBooter.java:115)
      	at org.apache.maven.surefire.booter.ForkedBooter.main(ForkedBooter.java:75)
      Caused by: java.net.ConnectException: Connection refused
      	at java.net.PlainSocketImpl.socketConnect(Native Method)
      	at java.net.AbstractPlainSocketImpl.doConnect(AbstractPlainSocketImpl.java:339)
      	at java.net.AbstractPlainSocketImpl.connectToAddress(AbstractPlainSocketImpl.java:200)
      	at java.net.AbstractPlainSocketImpl.connect(AbstractPlainSocketImpl.java:182)
      	at java.net.SocksSocketImpl.connect(SocksSocketImpl.java:392)
      	at java.net.Socket.connect(Socket.java:579)
      	at java.net.Socket.connect(Socket.java:528)
      	at java.net.Socket.<init>(Socket.java:425)
      	at java.net.Socket.<init>(Socket.java:208)
      	at org.jboss.byteman.agent.submit.Submit$Comm.<init>(Submit.java:871)
      	at org.jboss.byteman.agent.submit.Submit.submitRequest(Submit.java:777)
      	at org.jboss.byteman.agent.submit.Submit.deleteScripts(Submit.java:688)
      	at org.jboss.byteman.agent.submit.Submit.deleteRulesFromResources(Submit.java:661)
      	at org.jboss.jbossts.xts.bytemanSupport.BMScript.remove(BMScript.java:32)
      	... 54 more
      
      
      Results :
      
      Tests in error: 
        org.jboss.narayana.compensations.functional.compensatable.CompensatableTest: Failed to submit Byteman script
        org.jboss.narayana.compensations.functional.compensatable.CompensatableTest: Failed to remove Byteman script
      
      Tests run: 2, Failures: 0, Errors: 2, Skipped: 0
      

        Gliffy Diagrams

          Attachments

            Activity

              People

              • Assignee:
                gytis Gytis Trikleris
                Reporter:
                gytis Gytis Trikleris
              • Votes:
                0 Vote for this issue
                Watchers:
                1 Start watching this issue

                Dates

                • Created:
                  Updated:
                  Resolved: