Uploaded image for project: 'JBoss Transaction Manager'
  1. JBoss Transaction Manager
  2. JBTM-1193

XTS unit tests: IllegalStateException: testSetStarting called twice

    Details

    • Type: Bug
    • Status: Closed (View Workflow)
    • Priority: Major
    • Resolution: Done
    • Affects Version/s: 4.17.0.M1/5.0.0.M1
    • Fix Version/s: 4.17.0
    • Component/s: Testing, XTS
    • Labels:
      None

      Description

      See:

      http://172.17.131.2/view/Narayana+BlackTie/job/narayana-java6/1225/console
      http://172.17.131.2/view/Narayana+BlackTie/job/narayana-java6/1228/console
      http://172.17.131.2/view/Narayana+BlackTie/job/narayana-java6/1229/console

      Happens intermittently and has so far been seen for the wsas and wscf unit tests.

      Error:

      -------------------------------------------------------
       T E S T S
      -------------------------------------------------------
      Running com.arjuna.wscf11.tests.model.sagas.AddParticipantTest
      Tests run: 1, Failures: 0, Errors: 0, Skipped: 0, Time elapsed: 15.818 sec
      Running com.arjuna.wscf11.tests.model.sagas.BeginCancelTest
      [INFO] ------------------------------------------------------------------------
      [INFO] Reactor Summary:
      [INFO] 
      [INFO] localjunit tests for xts .......................... SUCCESS [2.185s]
      [INFO] wsas unit tests ................................... SUCCESS [23.262s]
      [INFO] wscf11 unit tests ................................. FAILURE [25.023s]
      [INFO] wstx unit tests ................................... SKIPPED
      [INFO] ws-c11 unit tests ................................. SKIPPED
      [INFO] ws-t11 unit tests ................................. SKIPPED
      [INFO] wstx11-interop .................................... SKIPPED
      [INFO] wstf-sc007-interop ................................ SKIPPED
      [INFO] ------------------------------------------------------------------------
      [INFO] BUILD FAILURE
      [INFO] ------------------------------------------------------------------------
      [INFO] Total time: 50.776s
      [INFO] Finished at: Wed Jun 20 21:28:37 BST 2012
      [INFO] Final Memory: 16M/39M
      [INFO] ------------------------------------------------------------------------
      [ERROR] Failed to execute goal org.apache.maven.plugins:maven-surefire-plugin:2.7.2:test (default-test) on project localjunit-wscf11-tests: Error while executing forked tests.; nested exception is java.lang.IllegalStateException: testSetStarting called twice -> [Help 1]
      

      This has happened for 4/6 of the last test runs on narayana-java6. narayana-java7 is failing earlier for another reason. It could well happen on java7 too.

      Marked as a blocker as I'm not happy doing the release until I know more about the issue.

        Gliffy Diagrams

          Attachments

            Activity

              People

              • Assignee:
                zhfeng Zheng Feng
                Reporter:
                paul.robinson Paul Robinson
              • Votes:
                0 Vote for this issue
                Watchers:
                2 Start watching this issue

                Dates

                • Created:
                  Updated:
                  Resolved: