Uploaded image for project: 'WildFly'
  1. WildFly
  2. WFLY-9527

AuthenticationForwardingSLSFTestCase in the manualmode integration tests fails with the JDK9

    Details

      Description

      [ERROR] Tests run: 14, Failures: 1, Errors: 5, Skipped: 1, Time elapsed: 15.372 s <<< FAILURE! - in org.wildfly.test.manual.elytron.seccontext.AuthenticationForwardingSLSFTestCase
      [ERROR] testServer2ExceptionFromForwardedAuthn(org.wildfly.test.manual.elytron.seccontext.AuthenticationForwardingSLSFTestCase)  Time elapsed: 0.129 s  <<< ERROR!
      org.jboss.ejb.client.RequestSendFailedException: EJBCLIENT000409: No more destinations are available
      	at org.jboss.ejb.client.EJBClientInvocationContext.getResult(EJBClientInvocationContext.java:567)
      	at org.jboss.ejb.client.EJBClientInvocationContext.getResult(EJBClientInvocationContext.java:503)
      	at org.jboss.ejb.protocol.remote.RemotingEJBClientInterceptor.handleInvocationResult(RemotingEJBClientInterceptor.java:56)
      	at org.jboss.ejb.client.EJBClientInvocationContext.getResult(EJBClientInvocationContext.java:569)
      	at org.jboss.ejb.client.EJBClientInvocationContext.getResult(EJBClientInvocationContext.java:503)
      	at org.jboss.ejb.client.TransactionPostDiscoveryInterceptor.handleInvocationResult(TransactionPostDiscoveryInterceptor.java:133)
      	at org.jboss.ejb.client.EJBClientInvocationContext.getResult(EJBClientInvocationContext.java:569)
      	at org.jboss.ejb.client.EJBClientInvocationContext.getResult(EJBClientInvocationContext.java:503)
      	at org.jboss.ejb.client.DiscoveryEJBClientInterceptor.handleInvocationResult(DiscoveryEJBClientInterceptor.java:108)
      	at org.jboss.ejb.client.EJBClientInvocationContext.getResult(EJBClientInvocationContext.java:569)
      	at org.jboss.ejb.client.EJBClientInvocationContext.getResult(EJBClientInvocationContext.java:503)
      	at org.jboss.ejb.client.NamingEJBClientInterceptor.handleInvocationResult(NamingEJBClientInterceptor.java:78)
      	at org.jboss.ejb.client.EJBClientInvocationContext.getResult(EJBClientInvocationContext.java:569)
      	at org.jboss.ejb.client.EJBClientInvocationContext.getResult(EJBClientInvocationContext.java:503)
      	at org.jboss.ejb.client.TransactionInterceptor.handleInvocationResult(TransactionInterceptor.java:172)
      	at org.jboss.ejb.client.EJBClientInvocationContext.getResult(EJBClientInvocationContext.java:569)
      	at org.jboss.ejb.client.EJBClientInvocationContext.getResult(EJBClientInvocationContext.java:503)
      	at org.jboss.ejb.client.EJBClientInvocationContext.awaitResponse(EJBClientInvocationContext.java:913)
      	at org.jboss.ejb.client.EJBInvocationHandler.invoke(EJBInvocationHandler.java:177)
      	at org.jboss.ejb.client.EJBInvocationHandler.invoke(EJBInvocationHandler.java:112)
      	at com.sun.proxy.$Proxy25.whoAmIAndServer2Exception(Unknown Source)
      	at org.wildfly.test.manual.elytron.seccontext.AbstractSecurityContextPropagationTestBase.lambda$getWhoAmIAndServer2ExceptionCallable$2(AbstractSecurityContextPropagationTestBase.java:492)
      	at org.wildfly.common.context.Contextual.runCallable(Contextual.java:127)
      	at org.wildfly.test.manual.elytron.seccontext.AbstractAuthenticationForwardingTestCase.testServer2ExceptionFromForwardedAuthn(AbstractAuthenticationForwardingTestCase.java:359)
      	at java.base/jdk.internal.reflect.NativeMethodAccessorImpl.invoke0(Native Method)
      	at java.base/jdk.internal.reflect.NativeMethodAccessorImpl.invoke(NativeMethodAccessorImpl.java:62)
      	at java.base/jdk.internal.reflect.DelegatingMethodAccessorImpl.invoke(DelegatingMethodAccessorImpl.java:43)
      	at java.base/java.lang.reflect.Method.invoke(Method.java:564)
      	at org.junit.runners.model.FrameworkMethod$1.runReflectiveCall(FrameworkMethod.java:50)
      	at org.junit.internal.runners.model.ReflectiveCallable.run(ReflectiveCallable.java:12)
      	at org.junit.runners.model.FrameworkMethod.invokeExplosively(FrameworkMethod.java:47)
      	at org.jboss.arquillian.junit.Arquillian$8$1.invoke(Arquillian.java:379)
      	at org.jboss.arquillian.container.test.impl.execution.LocalTestExecuter.execute(LocalTestExecuter.java:60)
      	at java.base/jdk.internal.reflect.NativeMethodAccessorImpl.invoke0(Native Method)
      	at java.base/jdk.internal.reflect.NativeMethodAccessorImpl.invoke(NativeMethodAccessorImpl.java:62)
      	at java.base/jdk.internal.reflect.DelegatingMethodAccessorImpl.invoke(DelegatingMethodAccessorImpl.java:43)
      	at java.base/java.lang.reflect.Method.invoke(Method.java:564)
      	at org.jboss.arquillian.core.impl.ObserverImpl.invoke(ObserverImpl.java:96)
      	at org.jboss.arquillian.core.impl.EventContextImpl.invokeObservers(EventContextImpl.java:103)
      	at org.jboss.arquillian.core.impl.EventContextImpl.proceed(EventContextImpl.java:85)
      	at org.jboss.arquillian.core.impl.ManagerImpl.fire(ManagerImpl.java:143)
      	at org.jboss.arquillian.core.impl.ManagerImpl.fire(ManagerImpl.java:114)
      	at org.jboss.arquillian.core.impl.EventImpl.fire(EventImpl.java:67)
      	at org.jboss.arquillian.container.test.impl.execution.ClientTestExecuter.execute(ClientTestExecuter.java:53)
      	at java.base/jdk.internal.reflect.NativeMethodAccessorImpl.invoke0(Native Method)
      	at java.base/jdk.internal.reflect.NativeMethodAccessorImpl.invoke(NativeMethodAccessorImpl.java:62)
      	at java.base/jdk.internal.reflect.DelegatingMethodAccessorImpl.invoke(DelegatingMethodAccessorImpl.java:43)
      	at java.base/java.lang.reflect.Method.invoke(Method.java:564)
      	at org.jboss.arquillian.core.impl.ObserverImpl.invoke(ObserverImpl.java:96)
      	at org.jboss.arquillian.core.impl.EventContextImpl.invokeObservers(EventContextImpl.java:103)
      	at org.jboss.arquillian.core.impl.EventContextImpl.proceed(EventContextImpl.java:85)
      	at org.jboss.arquillian.container.test.impl.client.ContainerEventController.createContext(ContainerEventController.java:142)
      	at org.jboss.arquillian.container.test.impl.client.ContainerEventController.createTestContext(ContainerEventController.java:129)
      	at java.base/jdk.internal.reflect.NativeMethodAccessorImpl.invoke0(Native Method)
      	at java.base/jdk.internal.reflect.NativeMethodAccessorImpl.invoke(NativeMethodAccessorImpl.java:62)
      	at java.base/jdk.internal.reflect.DelegatingMethodAccessorImpl.invoke(DelegatingMethodAccessorImpl.java:43)
      	at java.base/java.lang.reflect.Method.invoke(Method.java:564)
      	at org.jboss.arquillian.core.impl.ObserverImpl.invoke(ObserverImpl.java:96)
      	at org.jboss.arquillian.core.impl.EventContextImpl.proceed(EventContextImpl.java:92)
      	at org.jboss.arquillian.test.impl.TestContextHandler.createSuiteContext(TestContextHandler.java:73)
      	at java.base/jdk.internal.reflect.NativeMethodAccessorImpl.invoke0(Native Method)
      	at java.base/jdk.internal.reflect.NativeMethodAccessorImpl.invoke(NativeMethodAccessorImpl.java:62)
      	at java.base/jdk.internal.reflect.DelegatingMethodAccessorImpl.invoke(DelegatingMethodAccessorImpl.java:43)
      	at java.base/java.lang.reflect.Method.invoke(Method.java:564)
      	at org.jboss.arquillian.core.impl.ObserverImpl.invoke(ObserverImpl.java:96)
      	at org.jboss.arquillian.core.impl.EventContextImpl.proceed(EventContextImpl.java:92)
      	at org.jboss.arquillian.test.impl.TestContextHandler.createTestContext(TestContextHandler.java:130)
      	at java.base/jdk.internal.reflect.NativeMethodAccessorImpl.invoke0(Native Method)
      	at java.base/jdk.internal.reflect.NativeMethodAccessorImpl.invoke(NativeMethodAccessorImpl.java:62)
      	at java.base/jdk.internal.reflect.DelegatingMethodAccessorImpl.invoke(DelegatingMethodAccessorImpl.java:43)
      	at java.base/java.lang.reflect.Method.invoke(Method.java:564)
      	at org.jboss.arquillian.core.impl.ObserverImpl.invoke(ObserverImpl.java:96)
      	at org.jboss.arquillian.core.impl.EventContextImpl.proceed(EventContextImpl.java:92)
      	at org.jboss.arquillian.test.impl.TestContextHandler.createClassContext(TestContextHandler.java:92)
      	at java.base/jdk.internal.reflect.NativeMethodAccessorImpl.invoke0(Native Method)
      	at java.base/jdk.internal.reflect.NativeMethodAccessorImpl.invoke(NativeMethodAccessorImpl.java:62)
      	at java.base/jdk.internal.reflect.DelegatingMethodAccessorImpl.invoke(DelegatingMethodAccessorImpl.java:43)
      	at java.base/java.lang.reflect.Method.invoke(Method.java:564)
      	at org.jboss.arquillian.core.impl.ObserverImpl.invoke(ObserverImpl.java:96)
      	at org.jboss.arquillian.core.impl.EventContextImpl.proceed(EventContextImpl.java:92)
      	at org.jboss.arquillian.core.impl.ManagerImpl.fire(ManagerImpl.java:143)
      	at org.jboss.arquillian.test.impl.EventTestRunnerAdaptor.test(EventTestRunnerAdaptor.java:136)
      	at org.jboss.arquillian.junit.Arquillian$8.evaluate(Arquillian.java:372)
      	at org.jboss.arquillian.junit.Arquillian$4.evaluate(Arquillian.java:246)
      	at org.jboss.arquillian.junit.Arquillian.multiExecute(Arquillian.java:431)
      	at org.jboss.arquillian.junit.Arquillian.access$200(Arquillian.java:55)
      	at org.jboss.arquillian.junit.Arquillian$5.evaluate(Arquillian.java:260)
      	at org.jboss.arquillian.junit.Arquillian$7$1.invoke(Arquillian.java:324)
      	at org.jboss.arquillian.container.test.impl.execution.ClientBeforeAfterLifecycleEventExecuter.execute(ClientBeforeAfterLifecycleEventExecuter.java:99)
      	at org.jboss.arquillian.container.test.impl.execution.ClientBeforeAfterLifecycleEventExecuter.on(ClientBeforeAfterLifecycleEventExecuter.java:72)
      	at java.base/jdk.internal.reflect.NativeMethodAccessorImpl.invoke0(Native Method)
      	at java.base/jdk.internal.reflect.NativeMethodAccessorImpl.invoke(NativeMethodAccessorImpl.java:62)
      	at java.base/jdk.internal.reflect.DelegatingMethodAccessorImpl.invoke(DelegatingMethodAccessorImpl.java:43)
      	at java.base/java.lang.reflect.Method.invoke(Method.java:564)
      	at org.jboss.arquillian.core.impl.ObserverImpl.invoke(ObserverImpl.java:96)
      	at org.jboss.arquillian.core.impl.EventContextImpl.invokeObservers(EventContextImpl.java:103)
      	at org.jboss.arquillian.core.impl.EventContextImpl.proceed(EventContextImpl.java:85)
      	at org.jboss.arquillian.container.test.impl.client.ContainerEventController.createContext(ContainerEventController.java:142)
      	at org.jboss.arquillian.container.test.impl.client.ContainerEventController.createBeforeContext(ContainerEventController.java:124)
      	at java.base/jdk.internal.reflect.NativeMethodAccessorImpl.invoke0(Native Method)
      	at java.base/jdk.internal.reflect.NativeMethodAccessorImpl.invoke(NativeMethodAccessorImpl.java:62)
      	at java.base/jdk.internal.reflect.DelegatingMethodAccessorImpl.invoke(DelegatingMethodAccessorImpl.java:43)
      	at java.base/java.lang.reflect.Method.invoke(Method.java:564)
      	at org.jboss.arquillian.core.impl.ObserverImpl.invoke(ObserverImpl.java:96)
      	at org.jboss.arquillian.core.impl.EventContextImpl.proceed(EventContextImpl.java:92)
      	at org.jboss.arquillian.test.impl.TestContextHandler.createSuiteContext(TestContextHandler.java:73)
      	at java.base/jdk.internal.reflect.NativeMethodAccessorImpl.invoke0(Native Method)
      	at java.base/jdk.internal.reflect.NativeMethodAccessorImpl.invoke(NativeMethodAccessorImpl.java:62)
      	at java.base/jdk.internal.reflect.DelegatingMethodAccessorImpl.invoke(DelegatingMethodAccessorImpl.java:43)
      	at java.base/java.lang.reflect.Method.invoke(Method.java:564)
      	at org.jboss.arquillian.core.impl.ObserverImpl.invoke(ObserverImpl.java:96)
      	at org.jboss.arquillian.core.impl.EventContextImpl.proceed(EventContextImpl.java:92)
      	at org.jboss.arquillian.test.impl.TestContextHandler.createTestContext(TestContextHandler.java:130)
      	at java.base/jdk.internal.reflect.NativeMethodAccessorImpl.invoke0(Native Method)
      	at java.base/jdk.internal.reflect.NativeMethodAccessorImpl.invoke(NativeMethodAccessorImpl.java:62)
      	at java.base/jdk.internal.reflect.DelegatingMethodAccessorImpl.invoke(DelegatingMethodAccessorImpl.java:43)
      	at java.base/java.lang.reflect.Method.invoke(Method.java:564)
      	at org.jboss.arquillian.core.impl.ObserverImpl.invoke(ObserverImpl.java:96)
      	at org.jboss.arquillian.core.impl.EventContextImpl.proceed(EventContextImpl.java:92)
      	at org.jboss.arquillian.test.impl.TestContextHandler.createClassContext(TestContextHandler.java:92)
      	at java.base/jdk.internal.reflect.NativeMethodAccessorImpl.invoke0(Native Method)
      	at java.base/jdk.internal.reflect.NativeMethodAccessorImpl.invoke(NativeMethodAccessorImpl.java:62)
      	at java.base/jdk.internal.reflect.DelegatingMethodAccessorImpl.invoke(DelegatingMethodAccessorImpl.java:43)
      	at java.base/java.lang.reflect.Method.invoke(Method.java:564)
      	at org.jboss.arquillian.core.impl.ObserverImpl.invoke(ObserverImpl.java:96)
      	at org.jboss.arquillian.core.impl.EventContextImpl.proceed(EventContextImpl.java:92)
      	at org.jboss.arquillian.core.impl.ManagerImpl.fire(ManagerImpl.java:143)
      	at org.jboss.arquillian.core.impl.ManagerImpl.fire(ManagerImpl.java:114)
      	at org.jboss.arquillian.test.impl.EventTestRunnerAdaptor.fireCustomLifecycle(EventTestRunnerAdaptor.java:159)
      	at org.jboss.arquillian.junit.Arquillian$7.evaluate(Arquillian.java:317)
      	at org.junit.runners.ParentRunner.runLeaf(ParentRunner.java:325)
      	at org.junit.runners.BlockJUnit4ClassRunner.runChild(BlockJUnit4ClassRunner.java:78)
      	at org.junit.runners.BlockJUnit4ClassRunner.runChild(BlockJUnit4ClassRunner.java:57)
      	at org.junit.runners.ParentRunner$3.run(ParentRunner.java:290)
      	at org.junit.runners.ParentRunner$1.schedule(ParentRunner.java:71)
      	at org.junit.runners.ParentRunner.runChildren(ParentRunner.java:288)
      	at org.junit.runners.ParentRunner.access$000(ParentRunner.java:58)
      	at org.junit.runners.ParentRunner$2.evaluate(ParentRunner.java:268)
      	at org.jboss.arquillian.junit.Arquillian$2.evaluate(Arquillian.java:205)
      	at org.jboss.arquillian.junit.Arquillian.multiExecute(Arquillian.java:431)
      	at org.jboss.arquillian.junit.Arquillian.access$200(Arquillian.java:55)
      	at org.jboss.arquillian.junit.Arquillian$3.evaluate(Arquillian.java:219)
      	at org.junit.runners.ParentRunner.run(ParentRunner.java:363)
      	at org.jboss.arquillian.junit.Arquillian.run(Arquillian.java:167)
      	at org.junit.runners.Suite.runChild(Suite.java:128)
      	at org.junit.runners.Suite.runChild(Suite.java:27)
      	at org.junit.runners.ParentRunner$3.run(ParentRunner.java:290)
      	at org.junit.runners.ParentRunner$1.schedule(ParentRunner.java:71)
      	at org.junit.runners.ParentRunner.runChildren(ParentRunner.java:288)
      	at org.junit.runners.ParentRunner.access$000(ParentRunner.java:58)
      	at org.junit.runners.ParentRunner$2.evaluate(ParentRunner.java:268)
      	at org.junit.runners.ParentRunner.run(ParentRunner.java:363)
      	at org.apache.maven.surefire.junitcore.JUnitCore.run(JUnitCore.java:55)
      	at org.apache.maven.surefire.junitcore.JUnitCoreWrapper.createRequestAndRun(JUnitCoreWrapper.java:137)
      	at org.apache.maven.surefire.junitcore.JUnitCoreWrapper.executeEager(JUnitCoreWrapper.java:107)
      	at org.apache.maven.surefire.junitcore.JUnitCoreWrapper.execute(JUnitCoreWrapper.java:83)
      	at org.apache.maven.surefire.junitcore.JUnitCoreWrapper.execute(JUnitCoreWrapper.java:75)
      	at org.apache.maven.surefire.junitcore.JUnitCoreProvider.invoke(JUnitCoreProvider.java:159)
      	at org.apache.maven.surefire.booter.ForkedBooter.invokeProviderInSameClassLoader(ForkedBooter.java:373)
      	at org.apache.maven.surefire.booter.ForkedBooter.runSuitesInProcess(ForkedBooter.java:334)
      	at org.apache.maven.surefire.booter.ForkedBooter.execute(ForkedBooter.java:119)
      	at org.apache.maven.surefire.booter.ForkedBooter.main(ForkedBooter.java:407)
      	Suppressed: org.jboss.ejb.client.RequestSendFailedException
      		at org.jboss.ejb.protocol.remote.RemoteEJBReceiver$1.handleFailed(RemoteEJBReceiver.java:101)
      		at org.jboss.ejb.protocol.remote.RemoteEJBReceiver$1.handleFailed(RemoteEJBReceiver.java:74)
      		at org.xnio.IoFuture$HandlingNotifier.notify(IoFuture.java:215)
      		at org.xnio.AbstractIoFuture$NotifierRunnable.run(AbstractIoFuture.java:720)
      		at org.jboss.remoting3.EndpointImpl$TrackingExecutor.lambda$execute$0(EndpointImpl.java:926)
      		at java.base/java.util.concurrent.ThreadPoolExecutor.runWorker(ThreadPoolExecutor.java:1167)
      		at java.base/java.util.concurrent.ThreadPoolExecutor$Worker.run(ThreadPoolExecutor.java:641)
      		at java.base/java.lang.Thread.run(Thread.java:844)
      	Caused by: javax.security.sasl.SaslException: PLAIN: authorization ID and password must be specified
      		at java.security.sasl/com.sun.security.sasl.PlainClient.<init>(PlainClient.java:58)
      		at java.security.sasl/com.sun.security.sasl.ClientFactoryImpl.createSaslClient(ClientFactoryImpl.java:97)
      		at org.wildfly.security.sasl.util.SecurityProviderSaslClientFactory.createSaslClient(SecurityProviderSaslClientFactory.java:110)
      		at org.wildfly.security.sasl.util.AbstractDelegatingSaslClientFactory.createSaslClient(AbstractDelegatingSaslClientFactory.java:66)
      		at org.wildfly.security.sasl.util.ProtocolSaslClientFactory.createSaslClient(ProtocolSaslClientFactory.java:50)
      		at org.wildfly.security.sasl.util.AbstractDelegatingSaslClientFactory.createSaslClient(AbstractDelegatingSaslClientFactory.java:66)
      		at org.wildfly.security.sasl.util.ServerNameSaslClientFactory.createSaslClient(ServerNameSaslClientFactory.java:50)
      		at org.wildfly.security.sasl.util.AbstractDelegatingSaslClientFactory.createSaslClient(AbstractDelegatingSaslClientFactory.java:66)
      		at org.wildfly.security.sasl.util.PropertiesSaslClientFactory.createSaslClient(PropertiesSaslClientFactory.java:54)
      		at org.wildfly.security.sasl.util.AbstractDelegatingSaslClientFactory.createSaslClient(AbstractDelegatingSaslClientFactory.java:66)
      		at org.wildfly.security.sasl.util.ServerNameSaslClientFactory.createSaslClient(ServerNameSaslClientFactory.java:50)
      		at org.wildfly.security.sasl.util.FilterMechanismSaslClientFactory.createSaslClient(FilterMechanismSaslClientFactory.java:102)
      		at org.wildfly.security.sasl.util.AbstractDelegatingSaslClientFactory.createSaslClient(AbstractDelegatingSaslClientFactory.java:66)
      		at org.wildfly.security.sasl.util.LocalPrincipalSaslClientFactory.createSaslClient(LocalPrincipalSaslClientFactory.java:74)
      		at org.wildfly.security.sasl.util.PrivilegedSaslClientFactory.lambda$createSaslClient$0(PrivilegedSaslClientFactory.java:64)
      		at java.base/java.security.AccessController.doPrivileged(Native Method)
      		at org.wildfly.security.sasl.util.PrivilegedSaslClientFactory.createSaslClient(PrivilegedSaslClientFactory.java:64)
      		at org.wildfly.security.auth.client.AuthenticationConfiguration.createSaslClient(AuthenticationConfiguration.java:1320)
      		at org.wildfly.security.auth.client.AuthenticationContextConfigurationClient.createSaslClient(AuthenticationContextConfigurationClient.java:395)
      		at org.jboss.remoting3.remote.ClientConnectionOpenListener$Capabilities.handleEvent(ClientConnectionOpenListener.java:420)
      		at org.jboss.remoting3.remote.ClientConnectionOpenListener$Capabilities.handleEvent(ClientConnectionOpenListener.java:242)
      		at org.xnio.ChannelListeners.invokeChannelListener(ChannelListeners.java:92)
      		at org.xnio.conduits.ReadReadyHandler$ChannelListenerHandler.readReady(ReadReadyHandler.java:66)
      		at org.xnio.nio.NioSocketConduit.handleReady(NioSocketConduit.java:89)
      		at org.xnio.nio.WorkerThread.run(WorkerThread.java:591)
      		at ...asynchronous invocation...(Unknown Source)
      		at org.jboss.remoting3.EndpointImpl.connect(EndpointImpl.java:570)
      		at org.jboss.remoting3.EndpointImpl.connect(EndpointImpl.java:536)
      		at org.jboss.remoting3.ConnectionInfo$None.getConnection(ConnectionInfo.java:82)
      		at org.jboss.remoting3.ConnectionInfo.getConnection(ConnectionInfo.java:55)
      		at org.jboss.remoting3.EndpointImpl.doGetConnection(EndpointImpl.java:487)
      		at org.jboss.remoting3.EndpointImpl.getConnectedIdentity(EndpointImpl.java:433)
      		at org.jboss.remoting3.UncloseableEndpoint.getConnectedIdentity(UncloseableEndpoint.java:51)
      		at org.jboss.remoting3.Endpoint.getConnectedIdentity(Endpoint.java:122)
      		at org.jboss.ejb.protocol.remote.RemoteEJBReceiver.lambda$getConnection$2(RemoteEJBReceiver.java:185)
      		at java.base/java.security.AccessController.doPrivileged(Native Method)
      		at org.jboss.ejb.protocol.remote.RemoteEJBReceiver.getConnection(RemoteEJBReceiver.java:185)
      		at org.jboss.ejb.protocol.remote.RemoteEJBReceiver.processInvocation(RemoteEJBReceiver.java:128)
      		at org.jboss.ejb.client.EJBClientInvocationContext.sendRequest(EJBClientInvocationContext.java:454)
      		at org.jboss.ejb.protocol.remote.RemotingEJBClientInterceptor.handleInvocation(RemotingEJBClientInterceptor.java:51)
      		at org.jboss.ejb.client.EJBClientInvocationContext.sendRequest(EJBClientInvocationContext.java:466)
      		at org.jboss.ejb.client.TransactionPostDiscoveryInterceptor.handleInvocation(TransactionPostDiscoveryInterceptor.java:79)
      		at org.jboss.ejb.client.EJBClientInvocationContext.sendRequest(EJBClientInvocationContext.java:466)
      		at org.jboss.ejb.client.DiscoveryEJBClientInterceptor.handleInvocation(DiscoveryEJBClientInterceptor.java:89)
      		at org.jboss.ejb.client.EJBClientInvocationContext.sendRequest(EJBClientInvocationContext.java:466)
      		at org.jboss.ejb.client.NamingEJBClientInterceptor.handleInvocation(NamingEJBClientInterceptor.java:66)
      		at org.jboss.ejb.client.EJBClientInvocationContext.sendRequest(EJBClientInvocationContext.java:466)
      		at org.jboss.ejb.client.TransactionInterceptor.handleInvocation(TransactionInterceptor.java:165)
      		at org.jboss.ejb.client.EJBClientInvocationContext.sendRequest(EJBClientInvocationContext.java:466)
      		at org.wildfly.common.context.Contextual.runExConsumer(Contextual.java:203)
      		at org.jboss.ejb.client.EJBClientInvocationContext.sendRequestInitial(EJBClientInvocationContext.java:302)
      		at org.jboss.ejb.client.EJBInvocationHandler.invoke(EJBInvocationHandler.java:173)
      		at org.jboss.ejb.client.EJBInvocationHandler.invoke(EJBInvocationHandler.java:112)
      		at com.sun.proxy.$Proxy25.whoAmIAndServer2Exception(Unknown Source)
      		at org.wildfly.test.manual.elytron.seccontext.AbstractSecurityContextPropagationTestBase.lambda$getWhoAmIAndServer2ExceptionCallable$2(AbstractSecurityContextPropagationTestBase.java:492)
      		at org.wildfly.common.context.Contextual.runCallable(Contextual.java:127)
      		at org.wildfly.test.manual.elytron.seccontext.AbstractAuthenticationForwardingTestCase.testServer2ExceptionFromForwardedAuthn(AbstractAuthenticationForwardingTestCase.java:359)
      		at java.base/jdk.internal.reflect.NativeMethodAccessorImpl.invoke0(Native Method)
      		at java.base/jdk.internal.reflect.NativeMethodAccessorImpl.invoke(NativeMethodAccessorImpl.java:62)
      		at java.base/jdk.internal.reflect.DelegatingMethodAccessorImpl.invoke(DelegatingMethodAccessorImpl.java:43)
      		at java.base/java.lang.reflect.Method.invoke(Method.java:564)
      		at org.junit.runners.model.FrameworkMethod$1.runReflectiveCall(FrameworkMethod.java:50)
      		at org.junit.internal.runners.model.ReflectiveCallable.run(ReflectiveCallable.java:12)
      		at org.junit.runners.model.FrameworkMethod.invokeExplosively(FrameworkMethod.java:47)
      		at org.jboss.arquillian.junit.Arquillian$8$1.invoke(Arquillian.java:379)
      		at org.jboss.arquillian.container.test.impl.execution.LocalTestExecuter.execute(LocalTestExecuter.java:60)
      		at java.base/jdk.internal.reflect.NativeMethodAccessorImpl.invoke0(Native Method)
      		at java.base/jdk.internal.reflect.NativeMethodAccessorImpl.invoke(NativeMethodAccessorImpl.java:62)
      		at java.base/jdk.internal.reflect.DelegatingMethodAccessorImpl.invoke(DelegatingMethodAccessorImpl.java:43)
      		at java.base/java.lang.reflect.Method.invoke(Method.java:564)
      		at org.jboss.arquillian.core.impl.ObserverImpl.invoke(ObserverImpl.java:96)
      		at org.jboss.arquillian.core.impl.EventContextImpl.invokeObservers(EventContextImpl.java:103)
      		at org.jboss.arquillian.core.impl.EventContextImpl.proceed(EventContextImpl.java:85)
      		at org.jboss.arquillian.core.impl.ManagerImpl.fire(ManagerImpl.java:143)
      		at org.jboss.arquillian.core.impl.ManagerImpl.fire(ManagerImpl.java:114)
      		at org.jboss.arquillian.core.impl.EventImpl.fire(EventImpl.java:67)
      		at org.jboss.arquillian.container.test.impl.execution.ClientTestExecuter.execute(ClientTestExecuter.java:53)
      		at java.base/jdk.internal.reflect.NativeMethodAccessorImpl.invoke0(Native Method)
      		at java.base/jdk.internal.reflect.NativeMethodAccessorImpl.invoke(NativeMethodAccessorImpl.java:62)
      		at java.base/jdk.internal.reflect.DelegatingMethodAccessorImpl.invoke(DelegatingMethodAccessorImpl.java:43)
      		at java.base/java.lang.reflect.Method.invoke(Method.java:564)
      		at org.jboss.arquillian.core.impl.ObserverImpl.invoke(ObserverImpl.java:96)
      		at org.jboss.arquillian.core.impl.EventContextImpl.invokeObservers(EventContextImpl.java:103)
      		at org.jboss.arquillian.core.impl.EventContextImpl.proceed(EventContextImpl.java:85)
      		at org.jboss.arquillian.container.test.impl.client.ContainerEventController.createContext(ContainerEventController.java:142)
      		at org.jboss.arquillian.container.test.impl.client.ContainerEventController.createTestContext(ContainerEventController.java:129)
      		at java.base/jdk.internal.reflect.NativeMethodAccessorImpl.invoke0(Native Method)
      		at java.base/jdk.internal.reflect.NativeMethodAccessorImpl.invoke(NativeMethodAccessorImpl.java:62)
      		at java.base/jdk.internal.reflect.DelegatingMethodAccessorImpl.invoke(DelegatingMethodAccessorImpl.java:43)
      		at java.base/java.lang.reflect.Method.invoke(Method.java:564)
      		at org.jboss.arquillian.core.impl.ObserverImpl.invoke(ObserverImpl.java:96)
      		at org.jboss.arquillian.core.impl.EventContextImpl.proceed(EventContextImpl.java:92)
      		at org.jboss.arquillian.test.impl.TestContextHandler.createSuiteContext(TestContextHandler.java:73)
      		at java.base/jdk.internal.reflect.NativeMethodAccessorImpl.invoke0(Native Method)
      		at java.base/jdk.internal.reflect.NativeMethodAccessorImpl.invoke(NativeMethodAccessorImpl.java:62)
      		at java.base/jdk.internal.reflect.DelegatingMethodAccessorImpl.invoke(DelegatingMethodAccessorImpl.java:43)
      		at java.base/java.lang.reflect.Method.invoke(Method.java:564)
      		at org.jboss.arquillian.core.impl.ObserverImpl.invoke(ObserverImpl.java:96)
      		at org.jboss.arquillian.core.impl.EventContextImpl.proceed(EventContextImpl.java:92)
      		at org.jboss.arquillian.test.impl.TestContextHandler.createTestContext(TestContextHandler.java:130)
      		at java.base/jdk.internal.reflect.NativeMethodAccessorImpl.invoke0(Native Method)
      		at java.base/jdk.internal.reflect.NativeMethodAccessorImpl.invoke(NativeMethodAccessorImpl.java:62)
      		at java.base/jdk.internal.reflect.DelegatingMethodAccessorImpl.invoke(DelegatingMethodAccessorImpl.java:43)
      		at java.base/java.lang.reflect.Method.invoke(Method.java:564)
      		at org.jboss.arquillian.core.impl.ObserverImpl.invoke(ObserverImpl.java:96)
      		at org.jboss.arquillian.core.impl.EventContextImpl.proceed(EventContextImpl.java:92)
      		at org.jboss.arquillian.test.impl.TestContextHandler.createClassContext(TestContextHandler.java:92)
      		at java.base/jdk.internal.reflect.NativeMethodAccessorImpl.invoke0(Native Method)
      		at java.base/jdk.internal.reflect.NativeMethodAccessorImpl.invoke(NativeMethodAccessorImpl.java:62)
      		at java.base/jdk.internal.reflect.DelegatingMethodAccessorImpl.invoke(DelegatingMethodAccessorImpl.java:43)
      		at java.base/java.lang.reflect.Method.invoke(Method.java:564)
      		at org.jboss.arquillian.core.impl.ObserverImpl.invoke(ObserverImpl.java:96)
      		at org.jboss.arquillian.core.impl.EventContextImpl.proceed(EventContextImpl.java:92)
      		at org.jboss.arquillian.core.impl.ManagerImpl.fire(ManagerImpl.java:143)
      		at org.jboss.arquillian.test.impl.EventTestRunnerAdaptor.test(EventTestRunnerAdaptor.java:136)
      		at org.jboss.arquillian.junit.Arquillian$8.evaluate(Arquillian.java:372)
      		at org.jboss.arquillian.junit.Arquillian$4.evaluate(Arquillian.java:246)
      		at org.jboss.arquillian.junit.Arquillian.multiExecute(Arquillian.java:431)
      		at org.jboss.arquillian.junit.Arquillian.access$200(Arquillian.java:55)
      		at org.jboss.arquillian.junit.Arquillian$5.evaluate(Arquillian.java:260)
      		at org.jboss.arquillian.junit.Arquillian$7$1.invoke(Arquillian.java:324)
      		at org.jboss.arquillian.container.test.impl.execution.ClientBeforeAfterLifecycleEventExecuter.execute(ClientBeforeAfterLifecycleEventExecuter.java:99)
      		at org.jboss.arquillian.container.test.impl.execution.ClientBeforeAfterLifecycleEventExecuter.on(ClientBeforeAfterLifecycleEventExecuter.java:72)
      		at java.base/jdk.internal.reflect.NativeMethodAccessorImpl.invoke0(Native Method)
      		at java.base/jdk.internal.reflect.NativeMethodAccessorImpl.invoke(NativeMethodAccessorImpl.java:62)
      		at java.base/jdk.internal.reflect.DelegatingMethodAccessorImpl.invoke(DelegatingMethodAccessorImpl.java:43)
      		at java.base/java.lang.reflect.Method.invoke(Method.java:564)
      		at org.jboss.arquillian.core.impl.ObserverImpl.invoke(ObserverImpl.java:96)
      		at org.jboss.arquillian.core.impl.EventContextImpl.invokeObservers(EventContextImpl.java:103)
      		at org.jboss.arquillian.core.impl.EventContextImpl.proceed(EventContextImpl.java:85)
      		at org.jboss.arquillian.container.test.impl.client.ContainerEventController.createContext(ContainerEventController.java:142)
      		at org.jboss.arquillian.container.test.impl.client.ContainerEventController.createBeforeContext(ContainerEventController.java:124)
      		at java.base/jdk.internal.reflect.NativeMethodAccessorImpl.invoke0(Native Method)
      		at java.base/jdk.internal.reflect.NativeMethodAccessorImpl.invoke(NativeMethodAccessorImpl.java:62)
      		at java.base/jdk.internal.reflect.DelegatingMethodAccessorImpl.invoke(DelegatingMethodAccessorImpl.java:43)
      		at java.base/java.lang.reflect.Method.invoke(Method.java:564)
      		at org.jboss.arquillian.core.impl.ObserverImpl.invoke(ObserverImpl.java:96)
      		at org.jboss.arquillian.core.impl.EventContextImpl.proceed(EventContextImpl.java:92)
      		at org.jboss.arquillian.test.impl.TestContextHandler.createSuiteContext(TestContextHandler.java:73)
      		at java.base/jdk.internal.reflect.NativeMethodAccessorImpl.invoke0(Native Method)
      		at java.base/jdk.internal.reflect.NativeMethodAccessorImpl.invoke(NativeMethodAccessorImpl.java:62)
      		at java.base/jdk.internal.reflect.DelegatingMethodAccessorImpl.invoke(DelegatingMethodAccessorImpl.java:43)
      		at java.base/java.lang.reflect.Method.invoke(Method.java:564)
      		at org.jboss.arquillian.core.impl.ObserverImpl.invoke(ObserverImpl.java:96)
      		at org.jboss.arquillian.core.impl.EventContextImpl.proceed(EventContextImpl.java:92)
      		at org.jboss.arquillian.test.impl.TestContextHandler.createTestContext(TestContextHandler.java:130)
      		at java.base/jdk.internal.reflect.NativeMethodAccessorImpl.invoke0(Native Method)
      		at java.base/jdk.internal.reflect.NativeMethodAccessorImpl.invoke(NativeMethodAccessorImpl.java:62)
      		at java.base/jdk.internal.reflect.DelegatingMethodAccessorImpl.invoke(DelegatingMethodAccessorImpl.java:43)
      		at java.base/java.lang.reflect.Method.invoke(Method.java:564)
      		at org.jboss.arquillian.core.impl.ObserverImpl.invoke(ObserverImpl.java:96)
      		at org.jboss.arquillian.core.impl.EventContextImpl.proceed(EventContextImpl.java:92)
      		at org.jboss.arquillian.test.impl.TestContextHandler.createClassContext(TestContextHandler.java:92)
      		at java.base/jdk.internal.reflect.NativeMethodAccessorImpl.invoke0(Native Method)
      		at java.base/jdk.internal.reflect.NativeMethodAccessorImpl.invoke(NativeMethodAccessorImpl.java:62)
      		at java.base/jdk.internal.reflect.DelegatingMethodAccessorImpl.invoke(DelegatingMethodAccessorImpl.java:43)
      		at java.base/java.lang.reflect.Method.invoke(Method.java:564)
      		at org.jboss.arquillian.core.impl.ObserverImpl.invoke(ObserverImpl.java:96)
      		at org.jboss.arquillian.core.impl.EventContextImpl.proceed(EventContextImpl.java:92)
      		at org.jboss.arquillian.core.impl.ManagerImpl.fire(ManagerImpl.java:143)
      		at org.jboss.arquillian.core.impl.ManagerImpl.fire(ManagerImpl.java:114)
      		at org.jboss.arquillian.test.impl.EventTestRunnerAdaptor.fireCustomLifecycle(EventTestRunnerAdaptor.java:159)
      		at org.jboss.arquillian.junit.Arquillian$7.evaluate(Arquillian.java:317)
      		at org.junit.runners.ParentRunner.runLeaf(ParentRunner.java:325)
      		at org.junit.runners.BlockJUnit4ClassRunner.runChild(BlockJUnit4ClassRunner.java:78)
      		at org.junit.runners.BlockJUnit4ClassRunner.runChild(BlockJUnit4ClassRunner.java:57)
      		at org.junit.runners.ParentRunner$3.run(ParentRunner.java:290)
      		at org.junit.runners.ParentRunner$1.schedule(ParentRunner.java:71)
      		at org.junit.runners.ParentRunner.runChildren(ParentRunner.java:288)
      		at org.junit.runners.ParentRunner.access$000(ParentRunner.java:58)
      		at org.junit.runners.ParentRunner$2.evaluate(ParentRunner.java:268)
      		at org.jboss.arquillian.junit.Arquillian$2.evaluate(Arquillian.java:205)
      		at org.jboss.arquillian.junit.Arquillian.multiExecute(Arquillian.java:431)
      		at org.jboss.arquillian.junit.Arquillian.access$200(Arquillian.java:55)
      		at org.jboss.arquillian.junit.Arquillian$3.evaluate(Arquillian.java:219)
      		at org.junit.runners.ParentRunner.run(ParentRunner.java:363)
      		at org.jboss.arquillian.junit.Arquillian.run(Arquillian.java:167)
      		at org.junit.runners.Suite.runChild(Suite.java:128)
      		at org.junit.runners.Suite.runChild(Suite.java:27)
      		at org.junit.runners.ParentRunner$3.run(ParentRunner.java:290)
      		at org.junit.runners.ParentRunner$1.schedule(ParentRunner.java:71)
      		at org.junit.runners.ParentRunner.runChildren(ParentRunner.java:288)
      		at org.junit.runners.ParentRunner.access$000(ParentRunner.java:58)
      		at org.junit.runners.ParentRunner$2.evaluate(ParentRunner.java:268)
      		at org.junit.runners.ParentRunner.run(ParentRunner.java:363)
      		at org.apache.maven.surefire.junitcore.JUnitCore.run(JUnitCore.java:55)
      		at org.apache.maven.surefire.junitcore.JUnitCoreWrapper.createRequestAndRun(JUnitCoreWrapper.java:137)
      		at org.apache.maven.surefire.junitcore.JUnitCoreWrapper.executeEager(JUnitCoreWrapper.java:107)
      		at org.apache.maven.surefire.junitcore.JUnitCoreWrapper.execute(JUnitCoreWrapper.java:83)
      		at org.apache.maven.surefire.junitcore.JUnitCoreWrapper.execute(JUnitCoreWrapper.java:75)
      		at org.apache.maven.surefire.junitcore.JUnitCoreProvider.invoke(JUnitCoreProvider.java:159)
      		at org.apache.maven.surefire.booter.ForkedBooter.invokeProviderInSameClassLoader(ForkedBooter.java:373)
      		at org.apache.maven.surefire.booter.ForkedBooter.runSuitesInProcess(ForkedBooter.java:334)
      		at org.apache.maven.surefire.booter.ForkedBooter.execute(ForkedBooter.java:119)
      		at org.apache.maven.surefire.booter.ForkedBooter.main(ForkedBooter.java:407)
      

      NOTE, the manulmode should run with the maven-surefire-plugin 2.20.1 in the JDK-9

        Gliffy Diagrams

          Attachments

            Activity

              People

              • Assignee:
                baranowb Bartosz Baranowski
                Reporter:
                zhfeng Zheng Feng
              • Votes:
                0 Vote for this issue
                Watchers:
                5 Start watching this issue

                Dates

                • Created:
                  Updated:
                  Resolved: