Uploaded image for project: 'WildFly'
  1. WildFly
  2. WFLY-12429

MockitoException in InfinispanBeanTestCase on latest JDK13

    Details

      Description

      [INFO] Running org.wildfly.clustering.ejb.infinispan.bean.InfinispanBeanTestCase
      [ERROR] Tests run: 7, Failures: 0, Errors: 1, Skipped: 0, Time elapsed: 0.929 s <<< FAILURE! - in org.wildfly.clustering.ejb.infinispan.bean.InfinispanBeanTestCase
      [ERROR] isExpired(org.wildfly.clustering.ejb.infinispan.bean.InfinispanBeanTestCase) Time elapsed: 0.027 s <<< ERROR!
      org.mockito.exceptions.base.MockitoException:

      Cannot call abstract real method on java object!
      Calling real methods is only possible when mocking non abstract method.
      //correct example:
      when(mockOfConcreteClass.nonAbstractMethod()).thenCallRealMethod();
      at org.wildfly.clustering.ejb.infinispan.bean.InfinispanBeanTestCase.isExpired(InfinispanBeanTestCase.java:104)
      at java.base/jdk.internal.reflect.NativeMethodAccessorImpl.invoke0(Native Method)
      at java.base/jdk.internal.reflect.NativeMethodAccessorImpl.invoke(NativeMethodAccessorImpl.java:62)
      at java.base/jdk.internal.reflect.DelegatingMethodAccessorImpl.invoke(DelegatingMethodAccessorImpl.java:43)
      at java.base/java.lang.reflect.Method.invoke(Method.java:567)
      at org.junit.runners.model.FrameworkMethod$1.runReflectiveCall(FrameworkMethod.java:50)
      at org.junit.internal.runners.model.ReflectiveCallable.run(ReflectiveCallable.java:12)
      at org.junit.runners.model.FrameworkMethod.invokeExplosively(FrameworkMethod.java:47)
      at org.junit.internal.runners.statements.InvokeMethod.evaluate(InvokeMethod.java:17)
      at org.junit.internal.runners.statements.RunAfters.evaluate(RunAfters.java:27)
      at org.junit.runners.ParentRunner.runLeaf(ParentRunner.java:325)
      at org.junit.runners.BlockJUnit4ClassRunner.runChild(BlockJUnit4ClassRunner.java:78)
      at org.junit.runners.BlockJUnit4ClassRunner.runChild(BlockJUnit4ClassRunner.java:57)
      at org.junit.runners.ParentRunner$3.run(ParentRunner.java:290)
      at org.junit.runners.ParentRunner$1.schedule(ParentRunner.java:71)
      at org.junit.runners.ParentRunner.runChildren(ParentRunner.java:288)
      at org.junit.runners.ParentRunner.access$000(ParentRunner.java:58)
      at org.junit.runners.ParentRunner$2.evaluate(ParentRunner.java:268)
      at org.junit.runners.ParentRunner.run(ParentRunner.java:363)
      at org.apache.maven.surefire.junit4.JUnit4Provider.execute(JUnit4Provider.java:365)
      at org.apache.maven.surefire.junit4.JUnit4Provider.executeWithRerun(JUnit4Provider.java:273)
      at org.apache.maven.surefire.junit4.JUnit4Provider.executeTestSet(JUnit4Provider.java:238)
      at org.apache.maven.surefire.junit4.JUnit4Provider.invoke(JUnit4Provider.java:159)
      at org.apache.maven.surefire.booter.ForkedBooter.invokeProviderInSameClassLoader(ForkedBooter.java:383)
      at org.apache.maven.surefire.booter.ForkedBooter.runSuitesInProcess(ForkedBooter.java:344)
      at org.apache.maven.surefire.booter.ForkedBooter.execute(ForkedBooter.java:125)
      at org.apache.maven.surefire.booter.ForkedBooter.main(ForkedBooter.java:417)

        Gliffy Diagrams

          Attachments

            Activity

              People

              • Assignee:
                pferraro Paul Ferraro
                Reporter:
                ropalka Richard Opalka
              • Votes:
                0 Vote for this issue
                Watchers:
                2 Start watching this issue

                Dates

                • Created:
                  Updated:
                  Resolved: