Uploaded image for project: 'Seam Reports'
  1. Seam Reports
  2. SEAMREPORTS-24

Code coverage profile causes test errors

    Details

    • Type: Bug
    • Status: Closed (View Workflow)
    • Priority: Major
    • Resolution: Out of Date
    • Affects Version/s: 3.0.0.Alpha1
    • Fix Version/s: 3.1.0.CR1
    • Component/s: None
    • Labels:
      None
    • Affects:
      Release Notes

      Description

      http://ci.jboss.org/jenkins/view/Seam/job/Seam-3.X-reports-CI/267/

      Without the -Pcode-coverage profile, the tests pass

      Tests run: 2, Failures: 0, Errors: 2, Skipped: 0, Time elapsed: 0.446 sec <<< FAILURE!
      org.jboss.seam.reports.jasperreports.qualifiers.test.JasperReportsQualifierTest  Time elapsed: 0 sec  <<< ERROR!
      java.lang.RuntimeException: Could not invoke deployment method: public static org.jboss.shrinkwrap.api.spec.JavaArchive org.jboss.seam.reports.jasperreports.qualifiers.test.JasperReportsQualifierTest.createArchive()
              at org.jboss.arquillian.impl.client.deployment.AnnotationDeploymentScenarioGenerator.invoke(AnnotationDeploymentScenarioGenerator.java:166)
              at org.jboss.arquillian.impl.client.deployment.AnnotationDeploymentScenarioGenerator.generateDeployment(AnnotationDeploymentScenarioGenerator.java:100)
              at org.jboss.arquillian.impl.client.deployment.AnnotationDeploymentScenarioGenerator.generate(AnnotationDeploymentScenarioGenerator.java:55)
              at org.jboss.arquillian.impl.client.deployment.DeploymentGenerator.generateDeployment(DeploymentGenerator.java:76)
              at sun.reflect.NativeMethodAccessorImpl.invoke0(Native Method)
              at sun.reflect.NativeMethodAccessorImpl.invoke(NativeMethodAccessorImpl.java:39)
              at sun.reflect.DelegatingMethodAccessorImpl.invoke(DelegatingMethodAccessorImpl.java:25)
              at java.lang.reflect.Method.invoke(Method.java:597)
              at org.jboss.arquillian.impl.core.ObserverImpl.invoke(ObserverImpl.java:90)
              at org.jboss.arquillian.impl.core.EventContextImpl.invokeObservers(EventContextImpl.java:98)
              at org.jboss.arquillian.impl.core.EventContextImpl.proceed(EventContextImpl.java:80)
              at org.jboss.arquillian.impl.core.ManagerImpl.fire(ManagerImpl.java:126)
              at org.jboss.arquillian.impl.core.ManagerImpl.fire(ManagerImpl.java:106)
              at org.jboss.arquillian.impl.core.EventImpl.fire(EventImpl.java:67)
              at org.jboss.arquillian.impl.client.ContainerEventController.execute(ContainerEventController.java:68)
              at sun.reflect.NativeMethodAccessorImpl.invoke0(Native Method)
              at sun.reflect.NativeMethodAccessorImpl.invoke(NativeMethodAccessorImpl.java:39)
              at sun.reflect.DelegatingMethodAccessorImpl.invoke(DelegatingMethodAccessorImpl.java:25)
              at java.lang.reflect.Method.invoke(Method.java:597)
              at org.jboss.arquillian.impl.core.ObserverImpl.invoke(ObserverImpl.java:90)
              at org.jboss.arquillian.impl.core.EventContextImpl.invokeObservers(EventContextImpl.java:98)
              at org.jboss.arquillian.impl.core.EventContextImpl.proceed(EventContextImpl.java:80)
              at org.jboss.arquillian.impl.TestContextHandler.createClassContext(TestContextHandler.java:68)
              at sun.reflect.NativeMethodAccessorImpl.invoke0(Native Method)
              at sun.reflect.NativeMethodAccessorImpl.invoke(NativeMethodAccessorImpl.java:39)
              at sun.reflect.DelegatingMethodAccessorImpl.invoke(DelegatingMethodAccessorImpl.java:25)
              at java.lang.reflect.Method.invoke(Method.java:597)
              at org.jboss.arquillian.impl.core.ObserverImpl.invoke(ObserverImpl.java:90)
              at org.jboss.arquillian.impl.core.EventContextImpl.proceed(EventContextImpl.java:87)
              at org.jboss.arquillian.impl.TestContextHandler.createSuiteContext(TestContextHandler.java:54)
              at sun.reflect.NativeMethodAccessorImpl.invoke0(Native Method)
              at sun.reflect.NativeMethodAccessorImpl.invoke(NativeMethodAccessorImpl.java:39)
              at sun.reflect.DelegatingMethodAccessorImpl.invoke(DelegatingMethodAccessorImpl.java:25)
              at java.lang.reflect.Method.invoke(Method.java:597)
              at org.jboss.arquillian.impl.core.ObserverImpl.invoke(ObserverImpl.java:90)
              at org.jboss.arquillian.impl.core.EventContextImpl.proceed(EventContextImpl.java:87)
              at org.jboss.arquillian.impl.core.ManagerImpl.fire(ManagerImpl.java:126)
              at org.jboss.arquillian.impl.core.ManagerImpl.fire(ManagerImpl.java:106)
              at org.jboss.arquillian.impl.EventTestRunnerAdaptor.beforeClass(EventTestRunnerAdaptor.java:70)
              at org.jboss.arquillian.junit.Arquillian$2.evaluate(Arquillian.java:170)
              at org.jboss.arquillian.junit.Arquillian.multiExecute(Arquillian.java:303)
              at org.jboss.arquillian.junit.Arquillian.access$300(Arquillian.java:45)
              at org.jboss.arquillian.junit.Arquillian$3.evaluate(Arquillian.java:187)
              at org.junit.runners.ParentRunner.run(ParentRunner.java:236)
              at org.jboss.arquillian.junit.Arquillian.run(Arquillian.java:127)
              at org.apache.maven.surefire.junit4.JUnit4TestSet.execute(JUnit4TestSet.java:53)
              at org.apache.maven.surefire.junit4.JUnit4Provider.executeTestSet(JUnit4Provider.java:123)
              at org.apache.maven.surefire.junit4.JUnit4Provider.invoke(JUnit4Provider.java:104)
              at sun.reflect.NativeMethodAccessorImpl.invoke0(Native Method)
              at sun.reflect.NativeMethodAccessorImpl.invoke(NativeMethodAccessorImpl.java:39)
              at sun.reflect.DelegatingMethodAccessorImpl.invoke(DelegatingMethodAccessorImpl.java:25)
              at java.lang.reflect.Method.invoke(Method.java:597)
              at org.apache.maven.surefire.util.ReflectionUtils.invokeMethodWithArray(ReflectionUtils.java:164)
              at org.apache.maven.surefire.booter.ProviderFactory$ProviderProxy.invoke(ProviderFactory.java:110)
              at org.apache.maven.surefire.booter.SurefireStarter.invokeProvider(SurefireStarter.java:172)
              at org.apache.maven.surefire.booter.SurefireStarter.runSuitesInProcessWhenForked(SurefireStarter.java:104)
              at org.apache.maven.surefire.booter.ForkedBooter.main(ForkedBooter.java:70)
      Caused by: java.lang.reflect.InvocationTargetException
              at sun.reflect.NativeMethodAccessorImpl.invoke0(Native Method)
              at sun.reflect.NativeMethodAccessorImpl.invoke(NativeMethodAccessorImpl.java:39)
              at sun.reflect.DelegatingMethodAccessorImpl.invoke(DelegatingMethodAccessorImpl.java:25)
              at java.lang.reflect.Method.invoke(Method.java:597)
              at org.jboss.arquillian.impl.client.deployment.AnnotationDeploymentScenarioGenerator.invoke(AnnotationDeploymentScenarioGenerator.java:162)
              ... 56 more
      Caused by: java.lang.NoClassDefFoundError: org/jboss/seam/reports/jasper/JasperSeamReportLoader
              at org.jboss.seam.reports.jasperreports.qualifiers.test.JasperReportsQualifierTest.createArchive(JasperReportsQualifierTest.java:70)
              ... 61 more
      Caused by: java.lang.ClassNotFoundException: org.jboss.seam.reports.jasper.JasperSeamReportLoader
              at java.net.URLClassLoader$1.run(URLClassLoader.java:202)
              at java.security.AccessController.doPrivileged(Native Method)
              at java.net.URLClassLoader.findClass(URLClassLoader.java:190)
              at java.lang.ClassLoader.loadClass(ClassLoader.java:307)
              at sun.misc.Launcher$AppClassLoader.loadClass(Launcher.java:301)
              at java.lang.ClassLoader.loadClass(ClassLoader.java:248)
              ... 62 more
      org.jboss.seam.reports.jasperreports.qualifiers.test.JasperReportsQualifierTest  Time elapsed: 0.003 sec  <<< ERROR!
      java.lang.NullPointerException
              at org.jboss.arquillian.impl.client.container.ContainerDeployController.forEachManagedDeployment(ContainerDeployController.java:204)
              at org.jboss.arquillian.impl.client.container.ContainerDeployController.undeployManaged(ContainerDeployController.java:99)
              at sun.reflect.NativeMethodAccessorImpl.invoke0(Native Method)
              at sun.reflect.NativeMethodAccessorImpl.invoke(NativeMethodAccessorImpl.java:39)
              at sun.reflect.DelegatingMethodAccessorImpl.invoke(DelegatingMethodAccessorImpl.java:25)
              at java.lang.reflect.Method.invoke(Method.java:597)
              at org.jboss.arquillian.impl.core.ObserverImpl.invoke(ObserverImpl.java:90)
              at org.jboss.arquillian.impl.core.EventContextImpl.invokeObservers(EventContextImpl.java:98)
              at org.jboss.arquillian.impl.core.EventContextImpl.proceed(EventContextImpl.java:80)
              at org.jboss.arquillian.impl.core.ManagerImpl.fire(ManagerImpl.java:126)
              at org.jboss.arquillian.impl.core.ManagerImpl.fire(ManagerImpl.java:106)
              at org.jboss.arquillian.impl.core.EventImpl.fire(EventImpl.java:67)
              at org.jboss.arquillian.impl.client.ContainerEventController.execute(ContainerEventController.java:74)
              at sun.reflect.NativeMethodAccessorImpl.invoke0(Native Method)
              at sun.reflect.NativeMethodAccessorImpl.invoke(NativeMethodAccessorImpl.java:39)
              at sun.reflect.DelegatingMethodAccessorImpl.invoke(DelegatingMethodAccessorImpl.java:25)
              at java.lang.reflect.Method.invoke(Method.java:597)
              at org.jboss.arquillian.impl.core.ObserverImpl.invoke(ObserverImpl.java:90)
              at org.jboss.arquillian.impl.core.EventContextImpl.invokeObservers(EventContextImpl.java:98)
              at org.jboss.arquillian.impl.core.EventContextImpl.proceed(EventContextImpl.java:80)
              at org.jboss.arquillian.impl.TestContextHandler.createClassContext(TestContextHandler.java:68)
              at sun.reflect.NativeMethodAccessorImpl.invoke0(Native Method)
              at sun.reflect.NativeMethodAccessorImpl.invoke(NativeMethodAccessorImpl.java:39)
              at sun.reflect.DelegatingMethodAccessorImpl.invoke(DelegatingMethodAccessorImpl.java:25)
              at java.lang.reflect.Method.invoke(Method.java:597)
              at org.jboss.arquillian.impl.core.ObserverImpl.invoke(ObserverImpl.java:90)
              at org.jboss.arquillian.impl.core.EventContextImpl.proceed(EventContextImpl.java:87)
              at org.jboss.arquillian.impl.TestContextHandler.createSuiteContext(TestContextHandler.java:54)
              at sun.reflect.NativeMethodAccessorImpl.invoke0(Native Method)
              at sun.reflect.NativeMethodAccessorImpl.invoke(NativeMethodAccessorImpl.java:39)
              at sun.reflect.DelegatingMethodAccessorImpl.invoke(DelegatingMethodAccessorImpl.java:25)
              at java.lang.reflect.Method.invoke(Method.java:597)
              at org.jboss.arquillian.impl.core.ObserverImpl.invoke(ObserverImpl.java:90)
              at org.jboss.arquillian.impl.core.EventContextImpl.proceed(EventContextImpl.java:87)
              at org.jboss.arquillian.impl.core.ManagerImpl.fire(ManagerImpl.java:126)
              at org.jboss.arquillian.impl.core.ManagerImpl.fire(ManagerImpl.java:106)
              at org.jboss.arquillian.impl.EventTestRunnerAdaptor.afterClass(EventTestRunnerAdaptor.java:77)
              at org.jboss.arquillian.junit.Arquillian$3$1.evaluate(Arquillian.java:192)
              at org.jboss.arquillian.junit.Arquillian.multiExecute(Arquillian.java:303)
              at org.jboss.arquillian.junit.Arquillian.access$300(Arquillian.java:45)
              at org.jboss.arquillian.junit.Arquillian$3.evaluate(Arquillian.java:187)
              at org.junit.runners.ParentRunner.run(ParentRunner.java:236)
              at org.jboss.arquillian.junit.Arquillian.run(Arquillian.java:127)
              at org.apache.maven.surefire.junit4.JUnit4TestSet.execute(JUnit4TestSet.java:53)
              at org.apache.maven.surefire.junit4.JUnit4Provider.executeTestSet(JUnit4Provider.java:123)
              at org.apache.maven.surefire.junit4.JUnit4Provider.invoke(JUnit4Provider.java:104)
              at sun.reflect.NativeMethodAccessorImpl.invoke0(Native Method)
              at sun.reflect.NativeMethodAccessorImpl.invoke(NativeMethodAccessorImpl.java:39)
              at sun.reflect.DelegatingMethodAccessorImpl.invoke(DelegatingMethodAccessorImpl.java:25)
              at java.lang.reflect.Method.invoke(Method.java:597)
              at org.apache.maven.surefire.util.ReflectionUtils.invokeMethodWithArray(ReflectionUtils.java:164)
              at org.apache.maven.surefire.booter.ProviderFactory$ProviderProxy.invoke(ProviderFactory.java:110)
              at org.apache.maven.surefire.booter.SurefireStarter.invokeProvider(SurefireStarter.java:172)
              at org.apache.maven.surefire.booter.SurefireStarter.runSuitesInProcessWhenForked(SurefireStarter.java:104)
              at org.apache.maven.surefire.booter.ForkedBooter.main(ForkedBooter.java:70)
      

        Gliffy Diagrams

          Attachments

            Activity

              People

              • Assignee:
                jharting Jozef Hartinger
                Reporter:
                jharting Jozef Hartinger
              • Votes:
                0 Vote for this issue
                Watchers:
                1 Start watching this issue

                Dates

                • Created:
                  Updated:
                  Resolved: