RichFaces
  1. RichFaces
  2. RF-1583

List shuttle: JUnit tests with validation fail.

    Details

    • Type: Bug Bug
    • Status: Closed Closed (View Workflow)
    • Priority: Critical Critical
    • Resolution: Done
    • Affects Version/s: 3.1.3
    • Fix Version/s: 3.1.3
    • Component/s: None
    • Security Level: Public (Everyone can see)
    • Labels:
      None
    • Similar Issues:
      Show 10 results 

      Activity

      Hide
      Viktor Volkov
      added a comment -

      Running org.richfaces.component.ListShuttleComponentTest
      Tests run: 5, Failures: 0, Errors: 1, Skipped: 0, Time elapsed: 2.476 sec <<< FAILURE!

      ...

      Tests in error:
      testSaveRestore(org.richfaces.component.ListShuttleComponentTest)

      reproduces on revision 4805

      Show
      Viktor Volkov
      added a comment - Running org.richfaces.component.ListShuttleComponentTest Tests run: 5, Failures: 0, Errors: 1, Skipped: 0, Time elapsed: 2.476 sec <<< FAILURE! ... Tests in error: testSaveRestore(org.richfaces.component.ListShuttleComponentTest) reproduces on revision 4805
      Hide
      Tsikhon Kuprevich
      added a comment -

      [INFO] [compiler:compile]
      [INFO] Compiling 13 source files to C:\rhdevstudio\workspace\branch\ui\listShutt
      le\target\classes
      [INFO] ------------------------------------------------------------------------
      [ERROR] BUILD FAILURE
      [INFO] ------------------------------------------------------------------------
      [INFO] Compilation failure
      C:\rhdevstudio\workspace\branch\ui\listShuttle\src\main\java\org\richfaces\compo
      nent\UIListShuttle.java:[220,64] cannot find symbol
      symbol : variable INVALID_VALUE
      location: class org.ajax4jsf.Messages

      Reproduced CR4

      Show
      Tsikhon Kuprevich
      added a comment - [INFO] [compiler:compile] [INFO] Compiling 13 source files to C:\rhdevstudio\workspace\branch\ui\listShutt le\target\classes [INFO] ------------------------------------------------------------------------ [ERROR] BUILD FAILURE [INFO] ------------------------------------------------------------------------ [INFO] Compilation failure C:\rhdevstudio\workspace\branch\ui\listShuttle\src\main\java\org\richfaces\compo nent\UIListShuttle.java: [220,64] cannot find symbol symbol : variable INVALID_VALUE location: class org.ajax4jsf.Messages Reproduced CR4
      Hide
      Nick Belaevski
      added a comment -

      Not a bug, rebuild framework

      Show
      Nick Belaevski
      added a comment - Not a bug, rebuild framework
      Hide
      Jay Balunas
      added a comment -

      Part of a bulk update, all resolutions changed to done, please review history to original resolution type

      Show
      Jay Balunas
      added a comment - Part of a bulk update, all resolutions changed to done, please review history to original resolution type

        People

        • Assignee:
          Nick Belaevski
          Reporter:
          Sergey Halipov
        • Votes:
          0 Vote for this issue
          Watchers:
          0 Start watching this issue

          Dates

          • Created:
            Updated:
            Resolved: