Uploaded image for project: 'JBoss Transaction Manager'
  1. JBoss Transaction Manager
  2. JBTM-2645

XARecoveryModuleHelpersUnitTest.testTimelyXAResourceRecoveryHelperRemoval2 failure

    XMLWordPrintable

    Details

    • Type: Bug
    • Status: Closed (View Workflow)
    • Priority: Minor
    • Resolution: Won't Fix
    • Affects Version/s: None
    • Fix Version/s: None
    • Component/s: JTA
    • Labels:
      None

      Description

      Running com.hp.mwtests.ts.jta.recovery.XARecoveryModuleHelpersUnitTest
      Tests run: 3, Failures: 1, Errors: 0, Skipped: 0, Time elapsed: 7.636 sec <<< FAILURE! - in com.hp.mwtests.ts.jta.recovery.XARecoveryModuleHelpersUnitTest
      testTimelyXAResourceRecoveryHelperRemoval2(com.hp.mwtests.ts.jta.recovery.XARecoveryModuleHelpersUnitTest)  Time elapsed: 2.616 sec  <<< FAILURE!
      java.lang.AssertionError: helper2 removed in wrong state expected:<2> but was:<0>
      	at org.junit.Assert.fail(Assert.java:88)
      	at org.junit.Assert.failNotEquals(Assert.java:743)
      	at org.junit.Assert.assertEquals(Assert.java:118)
      	at org.junit.Assert.assertEquals(Assert.java:555)
      	at com.hp.mwtests.ts.jta.recovery.XARecoveryModuleHelpersUnitTest.testTimelyXAResourceRecoveryHelperRemoval(XARecoveryModuleHelpersUnitTest.java:212)
      	at com.hp.mwtests.ts.jta.recovery.XARecoveryModuleHelpersUnitTest.testTimelyXAResourceRecoveryHelperRemoval2(XARecoveryModuleHelpersUnitTest.java:64)
      

        Gliffy Diagrams

          Attachments

            Issue Links

              Activity

                People

                • Assignee:
                  tomjenkinson Thomas Jenkinson
                  Reporter:
                  gytis Gytis Trikleris
                • Votes:
                  0 Vote for this issue
                  Watchers:
                  2 Start watching this issue

                  Dates

                  • Created:
                    Updated:
                    Resolved: