Uploaded image for project: 'JBoss Transaction Manager'
  1. JBoss Transaction Manager
  2. JBTM-2608

org.wildfly.test.extension.rts.ParticipantTestCase failure

    Details

    • Type: Bug
    • Status: Closed (View Workflow)
    • Priority: Major
    • Resolution: Duplicate Issue
    • Affects Version/s: 5.2.12.Final
    • Fix Version/s: None
    • Component/s: REST
    • Labels:
      None

      Description

      http://172.17.130.4:8083/job/narayana-mac/PROFILE=MAIN,jdk=jdk8.latest,label=mac/165/

      I have raised the issue against narayana (as opposed to wfly) since it's probably related to changes on our master narayana branch:

      Tests run: 7, Failures: 0, Errors: 1, Skipped: 0, Time elapsed: 61.841 sec <<< FAILURE! - in org.wildfly.test.extension.rts.ParticipantTestCase
      testReadOnly(org.wildfly.test.extension.rts.ParticipantTestCase) Time elapsed: 60.432 sec <<< ERROR!
      java.lang.reflect.UndeclaredThrowableException: null
      at com.sun.proxy.$Proxy36.runTestMethod(Unknown Source)
      at org.jboss.arquillian.protocol.jmx.JMXMethodExecutor.invoke(JMXMethodExecutor.java:80)
      at org.jboss.arquillian.container.test.impl.execution.RemoteTestExecuter.execute(RemoteTestExecuter.java:109)
      at sun.reflect.NativeMethodAccessorImpl.invoke0(Native Method)
      at sun.reflect.NativeMethodAccessorImpl.invoke(NativeMethodAccessorImpl.java:62)
      at sun.reflect.DelegatingMethodAccessorImpl.invoke(DelegatingMethodAccessorImpl.java:43)
      at java.lang.reflect.Method.invoke(Method.java:497)
      at org.jboss.arquillian.core.impl.ObserverImpl.invoke(ObserverImpl.java:94)
      at org.jboss.arquillian.core.impl.EventContextImpl.invokeObservers(EventContextImpl.java:99)
      at org.jboss.arquillian.core.impl.EventContextImpl.proceed(EventContextImpl.java:81)
      at org.jboss.arquillian.core.impl.ManagerImpl.fire(ManagerImpl.java:145)
      at org.jboss.arquillian.core.impl.ManagerImpl.fire(ManagerImpl.java:116)
      at org.jboss.arquillian.core.impl.EventImpl.fire(EventImpl.java:67)
      at org.jboss.arquillian.container.test.impl.execution.ClientTestExecuter.execute(ClientTestExecuter.java:57)
      at sun.reflect.NativeMethodAccessorImpl.invoke0(Native Method)
      at sun.reflect.NativeMethodAccessorImpl.invoke(NativeMethodAccessorImpl.java:62)
      at sun.reflect.DelegatingMethodAccessorImpl.invoke(DelegatingMethodAccessorImpl.java:43)
      at java.lang.reflect.Method.invoke(Method.java:497)
      at org.jboss.arquillian.core.impl.ObserverImpl.invoke(ObserverImpl.java:94)
      at org.jboss.arquillian.core.impl.EventContextImpl.invokeObservers(EventContextImpl.java:99)
      at org.jboss.arquillian.core.impl.EventContextImpl.proceed(EventContextImpl.java:81)
      at org.jboss.arquillian.container.test.impl.client.ContainerEventController.createContext(ContainerEventController.java:142)
      at org.jboss.arquillian.container.test.impl.client.ContainerEventController.createTestContext(ContainerEventController.java:129)
      at sun.reflect.NativeMethodAccessorImpl.invoke0(Native Method)
      at sun.reflect.NativeMethodAccessorImpl.invoke(NativeMethodAccessorImpl.java:62)
      at sun.reflect.DelegatingMethodAccessorImpl.invoke(DelegatingMethodAccessorImpl.java:43)
      at java.lang.reflect.Method.invoke(Method.java:497)
      at org.jboss.arquillian.core.impl.ObserverImpl.invoke(ObserverImpl.java:94)
      at org.jboss.arquillian.core.impl.EventContextImpl.proceed(EventContextImpl.java:88)
      at org.jboss.arquillian.test.impl.TestContextHandler.createTestContext(TestContextHandler.java:130)
      at sun.reflect.GeneratedMethodAccessor3.invoke(Unknown Source)
      at sun.reflect.DelegatingMethodAccessorImpl.invoke(DelegatingMethodAccessorImpl.java:43)
      at java.lang.reflect.Method.invoke(Method.java:497)
      at org.jboss.arquillian.core.impl.ObserverImpl.invoke(ObserverImpl.java:94)
      at org.jboss.arquillian.core.impl.EventContextImpl.proceed(EventContextImpl.java:88)
      at org.jboss.arquillian.test.impl.TestContextHandler.createClassContext(TestContextHandler.java:92)
      at sun.reflect.GeneratedMethodAccessor2.invoke(Unknown Source)
      at sun.reflect.DelegatingMethodAccessorImpl.invoke(DelegatingMethodAccessorImpl.java:43)
      at java.lang.reflect.Method.invoke(Method.java:497)
      at org.jboss.arquillian.core.impl.ObserverImpl.invoke(ObserverImpl.java:94)
      at org.jboss.arquillian.core.impl.EventContextImpl.proceed(EventContextImpl.java:88)
      at org.jboss.arquillian.test.impl.TestContextHandler.createSuiteContext(TestContextHandler.java:73)
      at sun.reflect.GeneratedMethodAccessor1.invoke(Unknown Source)
      at sun.reflect.DelegatingMethodAccessorImpl.invoke(DelegatingMethodAccessorImpl.java:43)
      at java.lang.reflect.Method.invoke(Method.java:497)
      at org.jboss.arquillian.core.impl.ObserverImpl.invoke(ObserverImpl.java:94)
      at org.jboss.arquillian.core.impl.EventContextImpl.proceed(EventContextImpl.java:88)
      at org.jboss.arquillian.core.impl.ManagerImpl.fire(ManagerImpl.java:145)
      at org.jboss.arquillian.test.impl.EventTestRunnerAdaptor.test(EventTestRunnerAdaptor.java:136)
      at org.jboss.arquillian.junit.Arquillian$8.evaluate(Arquillian.java:363)
      at org.jboss.arquillian.junit.Arquillian$4.evaluate(Arquillian.java:245)
      at org.jboss.arquillian.junit.Arquillian.multiExecute(Arquillian.java:422)
      at org.jboss.arquillian.junit.Arquillian.access$200(Arquillian.java:54)
      at org.jboss.arquillian.junit.Arquillian$5.evaluate(Arquillian.java:259)
      at org.jboss.arquillian.junit.Arquillian$7.evaluate(Arquillian.java:321)
      at org.junit.runners.ParentRunner.runLeaf(ParentRunner.java:325)
      at org.junit.runners.BlockJUnit4ClassRunner.runChild(BlockJUnit4ClassRunner.java:78)
      at org.junit.runners.BlockJUnit4ClassRunner.runChild(BlockJUnit4ClassRunner.java:57)
      at org.junit.runners.ParentRunner$3.run(ParentRunner.java:290)
      at org.junit.runners.ParentRunner$1.schedule(ParentRunner.java:71)
      at org.junit.runners.ParentRunner.runChildren(ParentRunner.java:288)
      at org.junit.runners.ParentRunner.access$000(ParentRunner.java:58)
      at org.junit.runners.ParentRunner$2.evaluate(ParentRunner.java:268)
      at org.jboss.arquillian.junit.Arquillian$2.evaluate(Arquillian.java:204)
      at org.jboss.arquillian.junit.Arquillian.multiExecute(Arquillian.java:422)
      at org.jboss.arquillian.junit.Arquillian.access$200(Arquillian.java:54)
      at org.jboss.arquillian.junit.Arquillian$3.evaluate(Arquillian.java:218)
      at org.junit.runners.ParentRunner.run(ParentRunner.java:363)
      at org.jboss.arquillian.junit.Arquillian.run(Arquillian.java:166)
      at org.junit.runners.Suite.runChild(Suite.java:128)
      at org.junit.runners.Suite.runChild(Suite.java:27)
      at org.junit.runners.ParentRunner$3.run(ParentRunner.java:290)
      at org.junit.runners.ParentRunner$1.schedule(ParentRunner.java:71)
      at org.junit.runners.ParentRunner.runChildren(ParentRunner.java:288)
      at org.junit.runners.ParentRunner.access$000(ParentRunner.java:58)
      at org.junit.runners.ParentRunner$2.evaluate(ParentRunner.java:268)
      at org.junit.runners.ParentRunner.run(ParentRunner.java:363)
      at org.junit.runner.JUnitCore.run(JUnitCore.java:137)
      at org.junit.runner.JUnitCore.run(JUnitCore.java:115)
      at org.apache.maven.surefire.junitcore.JUnitCoreWrapper.createRequestAndRun(JUnitCoreWrapper.java:113)
      at org.apache.maven.surefire.junitcore.JUnitCoreWrapper.executeEager(JUnitCoreWrapper.java:85)
      at org.apache.maven.surefire.junitcore.JUnitCoreWrapper.execute(JUnitCoreWrapper.java:54)
      at org.apache.maven.surefire.junitcore.JUnitCoreProvider.invoke(JUnitCoreProvider.java:134)
      at org.apache.maven.surefire.booter.ForkedBooter.invokeProviderInSameClassLoader(ForkedBooter.java:200)
      at org.apache.maven.surefire.booter.ForkedBooter.runSuitesInProcess(ForkedBooter.java:153)
      at org.apache.maven.surefire.booter.ForkedBooter.main(ForkedBooter.java:103)
      Caused by: java.io.IOException: Unable to invoke invoke(), status=WAITING
      at org.jboss.remotingjmx.protocol.v2.ClientConnection$TheConnection.invoke(ClientConnection.java:1072)
      at org.jboss.as.arquillian.container.ManagementClient$MBeanConnectionProxy.invoke(ManagementClient.java:560)
      at javax.management.MBeanServerInvocationHandler.invoke(MBeanServerInvocationHandler.java:292)
      at com.sun.proxy.$Proxy36.runTestMethod(Unknown Source)
      at org.jboss.arquillian.protocol.jmx.JMXMethodExecutor.invoke(JMXMethodExecutor.java:80)
      at org.jboss.arquillian.container.test.impl.execution.RemoteTestExecuter.execute(RemoteTestExecuter.java:109)
      at sun.reflect.NativeMethodAccessorImpl.invoke0(Native Method)
      at sun.reflect.NativeMethodAccessorImpl.invoke(NativeMethodAccessorImpl.java:62)
      at sun.reflect.DelegatingMethodAccessorImpl.invoke(DelegatingMethodAccessorImpl.java:43)
      at java.lang.reflect.Method.invoke(Method.java:497)
      at org.jboss.arquillian.core.impl.ObserverImpl.invoke(ObserverImpl.java:94)
      at org.jboss.arquillian.core.impl.EventContextImpl.invokeObservers(EventContextImpl.java:99)
      at org.jboss.arquillian.core.impl.EventContextImpl.proceed(EventContextImpl.java:81)
      at org.jboss.arquillian.core.impl.ManagerImpl.fire(ManagerImpl.java:145)
      at org.jboss.arquillian.core.impl.ManagerImpl.fire(ManagerImpl.java:116)
      at org.jboss.arquillian.core.impl.EventImpl.fire(EventImpl.java:67)
      at org.jboss.arquillian.container.test.impl.execution.ClientTestExecuter.execute(ClientTestExecuter.java:57)
      at sun.reflect.NativeMethodAccessorImpl.invoke0(Native Method)
      at sun.reflect.NativeMethodAccessorImpl.invoke(NativeMethodAccessorImpl.java:62)
      at sun.reflect.DelegatingMethodAccessorImpl.invoke(DelegatingMethodAccessorImpl.java:43)
      at java.lang.reflect.Method.invoke(Method.java:497)
      at org.jboss.arquillian.core.impl.ObserverImpl.invoke(ObserverImpl.java:94)
      at org.jboss.arquillian.core.impl.EventContextImpl.invokeObservers(EventContextImpl.java:99)
      at org.jboss.arquillian.core.impl.EventContextImpl.proceed(EventContextImpl.java:81)
      at org.jboss.arquillian.container.test.impl.client.ContainerEventController.createContext(ContainerEventController.java:142)
      at org.jboss.arquillian.container.test.impl.client.ContainerEventController.createTestContext(ContainerEventController.java:129)
      at sun.reflect.NativeMethodAccessorImpl.invoke0(Native Method)
      at sun.reflect.NativeMethodAccessorImpl.invoke(NativeMethodAccessorImpl.java:62)
      at sun.reflect.DelegatingMethodAccessorImpl.invoke(DelegatingMethodAccessorImpl.java:43)
      at java.lang.reflect.Method.invoke(Method.java:497)
      at org.jboss.arquillian.core.impl.ObserverImpl.invoke(ObserverImpl.java:94)
      at org.jboss.arquillian.core.impl.EventContextImpl.proceed(EventContextImpl.java:88)
      at org.jboss.arquillian.test.impl.TestContextHandler.createTestContext(TestContextHandler.java:130)
      at sun.reflect.GeneratedMethodAccessor3.invoke(Unknown Source)
      at sun.reflect.DelegatingMethodAccessorImpl.invoke(DelegatingMethodAccessorImpl.java:43)
      at java.lang.reflect.Method.invoke(Method.java:497)
      at org.jboss.arquillian.core.impl.ObserverImpl.invoke(ObserverImpl.java:94)
      at org.jboss.arquillian.core.impl.EventContextImpl.proceed(EventContextImpl.java:88)
      at org.jboss.arquillian.test.impl.TestContextHandler.createClassContext(TestContextHandler.java:92)
      at sun.reflect.GeneratedMethodAccessor2.invoke(Unknown Source)
      at sun.reflect.DelegatingMethodAccessorImpl.invoke(DelegatingMethodAccessorImpl.java:43)
      at java.lang.reflect.Method.invoke(Method.java:497)
      at org.jboss.arquillian.core.impl.ObserverImpl.invoke(ObserverImpl.java:94)
      at org.jboss.arquillian.core.impl.EventContextImpl.proceed(EventContextImpl.java:88)
      at org.jboss.arquillian.test.impl.TestContextHandler.createSuiteContext(TestContextHandler.java:73)
      at sun.reflect.GeneratedMethodAccessor1.invoke(Unknown Source)
      at sun.reflect.DelegatingMethodAccessorImpl.invoke(DelegatingMethodAccessorImpl.java:43)
      at java.lang.reflect.Method.invoke(Method.java:497)
      at org.jboss.arquillian.core.impl.ObserverImpl.invoke(ObserverImpl.java:94)
      at org.jboss.arquillian.core.impl.EventContextImpl.proceed(EventContextImpl.java:88)
      at org.jboss.arquillian.core.impl.ManagerImpl.fire(ManagerImpl.java:145)
      at org.jboss.arquillian.test.impl.EventTestRunnerAdaptor.test(EventTestRunnerAdaptor.java:136)
      at org.jboss.arquillian.junit.Arquillian$8.evaluate(Arquillian.java:363)
      at org.jboss.arquillian.junit.Arquillian$4.evaluate(Arquillian.java:245)
      at org.jboss.arquillian.junit.Arquillian.multiExecute(Arquillian.java:422)
      at org.jboss.arquillian.junit.Arquillian.access$200(Arquillian.java:54)
      at org.jboss.arquillian.junit.Arquillian$5.evaluate(Arquillian.java:259)
      at org.jboss.arquillian.junit.Arquillian$7.evaluate(Arquillian.java:321)
      at org.junit.runners.ParentRunner.runLeaf(ParentRunner.java:325)
      at org.junit.runners.BlockJUnit4ClassRunner.runChild(BlockJUnit4ClassRunner.java:78)
      at org.junit.runners.BlockJUnit4ClassRunner.runChild(BlockJUnit4ClassRunner.java:57)
      at org.junit.runners.ParentRunner$3.run(ParentRunner.java:290)
      at org.junit.runners.ParentRunner$1.schedule(ParentRunner.java:71)
      at org.junit.runners.ParentRunner.runChildren(ParentRunner.java:288)
      at org.junit.runners.ParentRunner.access$000(ParentRunner.java:58)
      at org.junit.runners.ParentRunner$2.evaluate(ParentRunner.java:268)
      at org.jboss.arquillian.junit.Arquillian$2.evaluate(Arquillian.java:204)
      at org.jboss.arquillian.junit.Arquillian.multiExecute(Arquillian.java:422)
      at org.jboss.arquillian.junit.Arquillian.access$200(Arquillian.java:54)
      at org.jboss.arquillian.junit.Arquillian$3.evaluate(Arquillian.java:218)
      at org.junit.runners.ParentRunner.run(ParentRunner.java:363)
      at org.jboss.arquillian.junit.Arquillian.run(Arquillian.java:166)
      at org.junit.runners.Suite.runChild(Suite.java:128)
      at org.junit.runners.Suite.runChild(Suite.java:27)
      at org.junit.runners.ParentRunner$3.run(ParentRunner.java:290)
      at org.junit.runners.ParentRunner$1.schedule(ParentRunner.java:71)
      at org.junit.runners.ParentRunner.runChildren(ParentRunner.java:288)
      at org.junit.runners.ParentRunner.access$000(ParentRunner.java:58)
      at org.junit.runners.ParentRunner$2.evaluate(ParentRunner.java:268)
      at org.junit.runners.ParentRunner.run(ParentRunner.java:363)
      at org.junit.runner.JUnitCore.run(JUnitCore.java:137)
      at org.junit.runner.JUnitCore.run(JUnitCore.java:115)
      at org.apache.maven.surefire.junitcore.JUnitCoreWrapper.createRequestAndRun(JUnitCoreWrapper.java:113)
      at org.apache.maven.surefire.junitcore.JUnitCoreWrapper.executeEager(JUnitCoreWrapper.java:85)
      at org.apache.maven.surefire.junitcore.JUnitCoreWrapper.execute(JUnitCoreWrapper.java:54)
      at org.apache.maven.surefire.junitcore.JUnitCoreProvider.invoke(JUnitCoreProvider.java:134)
      at org.apache.maven.surefire.booter.ForkedBooter.invokeProviderInSameClassLoader(ForkedBooter.java:200)
      at org.apache.maven.surefire.booter.ForkedBooter.runSuitesInProcess(ForkedBooter.java:153)
      at org.apache.maven.surefire.booter.ForkedBooter.main(ForkedBooter.java:103)

        Gliffy Diagrams

          Attachments

            Issue Links

              Activity

                People

                • Assignee:
                  gytis Gytis Trikleris
                  Reporter:
                  mmusgrov Michael Musgrove
                • Votes:
                  0 Vote for this issue
                  Watchers:
                  1 Start watching this issue

                  Dates

                  • Created:
                    Updated:
                    Resolved: