Uploaded image for project: 'JBoss Transaction Manager'
  1. JBoss Transaction Manager
  2. JBTM-2507

XTS qa test failures on IBM JDK

    XMLWordPrintable

    Details

    • Type: Bug
    • Status: Closed (View Workflow)
    • Priority: Minor
    • Resolution: Done
    • Affects Version/s: None
    • Fix Version/s: 5.2.3.Final
    • Component/s: XTS
    • Labels:
      None

      Description

      Running com.arjuna.qa.junit.TestBACrashDuringCommit
      Tests run: 8, Failures: 0, Errors: 1, Skipped: 0, Time elapsed: 2,179.93 sec <<< FAILURE!
      MultiParticipantCoordinatorCompletionParticipantCloseAndExitTest(com.arjuna.qa.junit.TestBACrashDuringCommit)  Time elapsed: 672.338 sec  <<< ERROR!
      java.lang.RuntimeException: jboss-as was not killed by Byteman, this indicates a test failure
      	at com.arjuna.qa.extension.BaseServerKillProcessor.kill(BaseServerKillProcessor.java:62)
      	at org.jboss.arquillian.container.impl.ContainerImpl.kill(ContainerImpl.java:235)
      	at org.jboss.arquillian.container.impl.client.container.ContainerLifecycleController$10.perform(ContainerLifecycleController.java:193)
      	at org.jboss.arquillian.container.impl.client.container.ContainerLifecycleController$10.perform(ContainerLifecycleController.java:187)
      	at org.jboss.arquillian.container.impl.client.container.ContainerLifecycleController.forContainer(ContainerLifecycleController.java:255)
      	at org.jboss.arquillian.container.impl.client.container.ContainerLifecycleController.killContainer(ContainerLifecycleController.java:186)
      	at sun.reflect.GeneratedMethodAccessor16.invoke(Unknown Source)
      	at sun.reflect.DelegatingMethodAccessorImpl.invoke(DelegatingMethodAccessorImpl.java:55)
      	at java.lang.reflect.Method.invoke(Method.java:507)
      	at org.jboss.arquillian.core.impl.ObserverImpl.invoke(ObserverImpl.java:94)
      	at org.jboss.arquillian.core.impl.EventContextImpl.invokeObservers(EventContextImpl.java:99)
      	at org.jboss.arquillian.core.impl.EventContextImpl.proceed(EventContextImpl.java:81)
      	at org.jboss.arquillian.container.impl.client.ContainerDeploymentContextHandler.createContainerContext(ContainerDeploymentContextHandler.java:57)
      	at sun.reflect.GeneratedMethodAccessor4.invoke(Unknown Source)
      	at sun.reflect.DelegatingMethodAccessorImpl.invoke(DelegatingMethodAccessorImpl.java:55)
      	at java.lang.reflect.Method.invoke(Method.java:507)
      	at org.jboss.arquillian.core.impl.ObserverImpl.invoke(ObserverImpl.java:94)
      	at org.jboss.arquillian.core.impl.EventContextImpl.proceed(EventContextImpl.java:88)
      	at org.jboss.arquillian.core.impl.ManagerImpl.fire(ManagerImpl.java:145)
      	at org.jboss.arquillian.core.impl.ManagerImpl.fire(ManagerImpl.java:116)
      	at org.jboss.arquillian.core.impl.EventImpl.fire(EventImpl.java:67)
      	at org.jboss.arquillian.container.test.impl.client.container.ClientContainerController.kill(ClientContainerController.java:230)
      	at com.arjuna.qa.junit.BaseCrashTest.runTest(BaseCrashTest.java:209)
      	at com.arjuna.qa.junit.TestBACrashDuringCommit.MultiParticipantCoordinatorCompletionParticipantCloseAndExitTest(TestBACrashDuringCommit.java:24)
      
      Running com.arjuna.qa.junit.TestATSubordinateCrashDuringPrepare
      Tests run: 2, Failures: 1, Errors: 1, Skipped: 0, Time elapsed: 184.27 sec <<< FAILURE!
      subordinateMultiParticipantPrepareAndCommitTest(com.arjuna.qa.junit.TestATSubordinateCrashDuringPrepare)  Time elapsed: 184.212 sec  <<< ERROR!
      org.jboss.arquillian.container.spi.client.container.LifecycleException: Could not start container
      	at org.jboss.as.arquillian.container.managed.ManagedDeployableContainer.startInternal(ManagedDeployableContainer.java:158)
      	at org.jboss.as.arquillian.container.CommonDeployableContainer.start(CommonDeployableContainer.java:110)
      	at org.jboss.arquillian.container.impl.ContainerImpl.start(ContainerImpl.java:199)
      	at org.jboss.arquillian.container.impl.client.container.ContainerLifecycleController$8.perform(ContainerLifecycleController.java:163)
      	at org.jboss.arquillian.container.impl.client.container.ContainerLifecycleController$8.perform(ContainerLifecycleController.java:157)
      	at org.jboss.arquillian.container.impl.client.container.ContainerLifecycleController.forContainer(ContainerLifecycleController.java:255)
      	at org.jboss.arquillian.container.impl.client.container.ContainerLifecycleController.startContainer(ContainerLifecycleController.java:156)
      	at sun.reflect.NativeMethodAccessorImpl.invoke0(Native Method)
      	at sun.reflect.NativeMethodAccessorImpl.invoke(NativeMethodAccessorImpl.java:95)
      	at sun.reflect.DelegatingMethodAccessorImpl.invoke(DelegatingMethodAccessorImpl.java:55)
      	at java.lang.reflect.Method.invoke(Method.java:507)
      	at org.jboss.arquillian.core.impl.ObserverImpl.invoke(ObserverImpl.java:94)
      	at org.jboss.arquillian.core.impl.EventContextImpl.invokeObservers(EventContextImpl.java:99)
      	at org.jboss.arquillian.core.impl.EventContextImpl.proceed(EventContextImpl.java:81)
      	at org.jboss.arquillian.container.impl.client.ContainerDeploymentContextHandler.createContainerContext(ContainerDeploymentContextHandler.java:57)
      	at sun.reflect.GeneratedMethodAccessor4.invoke(Unknown Source)
      	at sun.reflect.DelegatingMethodAccessorImpl.invoke(DelegatingMethodAccessorImpl.java:55)
      	at java.lang.reflect.Method.invoke(Method.java:507)
      	at org.jboss.arquillian.core.impl.ObserverImpl.invoke(ObserverImpl.java:94)
      	at org.jboss.arquillian.core.impl.EventContextImpl.proceed(EventContextImpl.java:88)
      	at org.jboss.arquillian.core.impl.ManagerImpl.fire(ManagerImpl.java:145)
      	at org.jboss.arquillian.core.impl.ManagerImpl.fire(ManagerImpl.java:116)
      	at org.jboss.arquillian.core.impl.EventImpl.fire(EventImpl.java:67)
      	at org.jboss.arquillian.container.test.impl.client.container.ClientContainerController.start(ClientContainerController.java:150)
      	at com.arjuna.qa.junit.BaseCrashTest.runTest(BaseCrashTest.java:213)
      	at com.arjuna.qa.junit.TestATSubordinateCrashDuringPrepare.subordinateMultiParticipantPrepareAndCommitTest(TestATSubordinateCrashDuringPrepare.java:17)
      
      subordinateMultiParticipantPrepareAndCommitTest(com.arjuna.qa.junit.TestATSubordinateCrashDuringPrepare)  Time elapsed: 184.243 sec  <<< FAILURE!
      java.lang.AssertionError: null
      	at org.junit.Assert.fail(Assert.java:86)
      	at org.junit.Assert.assertTrue(Assert.java:41)
      	at org.junit.Assert.assertTrue(Assert.java:52)
      	at com.arjuna.qa.junit.BaseCrashTest.tearDown(BaseCrashTest.java:172)
      	at sun.reflect.NativeMethodAccessorImpl.invoke0(Native Method)
      	at sun.reflect.NativeMethodAccessorImpl.invoke(NativeMethodAccessorImpl.java:95)
      	at sun.reflect.DelegatingMethodAccessorImpl.invoke(DelegatingMethodAccessorImpl.java:55)
      	at java.lang.reflect.Method.invoke(Method.java:507)
      	at org.junit.runners.model.FrameworkMethod$1.runReflectiveCall(FrameworkMethod.java:47)
      	at org.junit.internal.runners.model.ReflectiveCallable.run(ReflectiveCallable.java:12)
      	at org.junit.runners.model.FrameworkMethod.invokeExplosively(FrameworkMethod.java:44)
      	at org.junit.internal.runners.statements.RunAfters.evaluate(RunAfters.java:33)
      	at org.jboss.arquillian.junit.Arquillian$StatementLifecycleExecutor.invoke(Arquillian.java:459)
      	at org.jboss.arquillian.container.test.impl.execution.ClientBeforeAfterLifecycleEventExecuter.execute(ClientBeforeAfterLifecycleEventExecuter.java:99)
      	at org.jboss.arquillian.container.test.impl.execution.ClientBeforeAfterLifecycleEventExecuter.on(ClientBeforeAfterLifecycleEventExecuter.java:80)
      	at sun.reflect.NativeMethodAccessorImpl.invoke0(Native Method)
      	at sun.reflect.NativeMethodAccessorImpl.invoke(NativeMethodAccessorImpl.java:95)
      	at sun.reflect.DelegatingMethodAccessorImpl.invoke(DelegatingMethodAccessorImpl.java:55)
      	at java.lang.reflect.Method.invoke(Method.java:507)
      	at org.jboss.arquillian.core.impl.ObserverImpl.invoke(ObserverImpl.java:94)
      	at org.jboss.arquillian.core.impl.EventContextImpl.invokeObservers(EventContextImpl.java:99)
      	at org.jboss.arquillian.core.impl.EventContextImpl.proceed(EventContextImpl.java:81)
      	at org.jboss.arquillian.container.test.impl.client.ContainerEventController.createContext(ContainerEventController.java:142)
      	at org.jboss.arquillian.container.test.impl.client.ContainerEventController.createAfterContext(ContainerEventController.java:134)
      	at sun.reflect.NativeMethodAccessorImpl.invoke0(Native Method)
      	at sun.reflect.NativeMethodAccessorImpl.invoke(NativeMethodAccessorImpl.java:95)
      	at sun.reflect.DelegatingMethodAccessorImpl.invoke(DelegatingMethodAccessorImpl.java:55)
      	at java.lang.reflect.Method.invoke(Method.java:507)
      	at org.jboss.arquillian.core.impl.ObserverImpl.invoke(ObserverImpl.java:94)
      	at org.jboss.arquillian.core.impl.EventContextImpl.proceed(EventContextImpl.java:88)
      	at org.jboss.arquillian.junit.extension.UpdateTestResultBeforeAfter.update(UpdateTestResultBeforeAfter.java:54)
      	at sun.reflect.NativeMethodAccessorImpl.invoke0(Native Method)
      	at sun.reflect.NativeMethodAccessorImpl.invoke(NativeMethodAccessorImpl.java:95)
      	at sun.reflect.DelegatingMethodAccessorImpl.invoke(DelegatingMethodAccessorImpl.java:55)
      	at java.lang.reflect.Method.invoke(Method.java:507)
      	at org.jboss.arquillian.core.impl.ObserverImpl.invoke(ObserverImpl.java:94)
      	at org.jboss.arquillian.core.impl.EventContextImpl.proceed(EventContextImpl.java:88)
      	at org.jboss.arquillian.test.impl.TestContextHandler.createTestContext(TestContextHandler.java:130)
      	at sun.reflect.GeneratedMethodAccessor7.invoke(Unknown Source)
      	at sun.reflect.DelegatingMethodAccessorImpl.invoke(DelegatingMethodAccessorImpl.java:55)
      	at java.lang.reflect.Method.invoke(Method.java:507)
      	at org.jboss.arquillian.core.impl.ObserverImpl.invoke(ObserverImpl.java:94)
      	at org.jboss.arquillian.core.impl.EventContextImpl.proceed(EventContextImpl.java:88)
      	at org.jboss.arquillian.test.impl.TestContextHandler.createClassContext(TestContextHandler.java:92)
      	at sun.reflect.GeneratedMethodAccessor6.invoke(Unknown Source)
      	at sun.reflect.DelegatingMethodAccessorImpl.invoke(DelegatingMethodAccessorImpl.java:55)
      	at java.lang.reflect.Method.invoke(Method.java:507)
      	at org.jboss.arquillian.core.impl.ObserverImpl.invoke(ObserverImpl.java:94)
      	at org.jboss.arquillian.core.impl.EventContextImpl.proceed(EventContextImpl.java:88)
      	at org.jboss.arquillian.test.impl.TestContextHandler.createSuiteContext(TestContextHandler.java:73)
      	at sun.reflect.GeneratedMethodAccessor5.invoke(Unknown Source)
      	at sun.reflect.DelegatingMethodAccessorImpl.invoke(DelegatingMethodAccessorImpl.java:55)
      	at java.lang.reflect.Method.invoke(Method.java:507)
      	at org.jboss.arquillian.core.impl.ObserverImpl.invoke(ObserverImpl.java:94)
      	at org.jboss.arquillian.core.impl.EventContextImpl.proceed(EventContextImpl.java:88)
      	at org.jboss.arquillian.core.impl.ManagerImpl.fire(ManagerImpl.java:145)
      	at org.jboss.arquillian.core.impl.ManagerImpl.fire(ManagerImpl.java:116)
      	at org.jboss.arquillian.test.impl.EventTestRunnerAdaptor.after(EventTestRunnerAdaptor.java:122)
      	at org.jboss.arquillian.junit.Arquillian$5$1.evaluate(Arquillian.java:264)
      	at org.jboss.arquillian.junit.Arquillian.multiExecute(Arquillian.java:422)
      	at org.jboss.arquillian.junit.Arquillian.access$200(Arquillian.java:54)
      	at org.jboss.arquillian.junit.Arquillian$5.evaluate(Arquillian.java:259)
      	at org.jboss.arquillian.junit.Arquillian$7$1.invoke(Arquillian.java:315)
      	at org.jboss.arquillian.container.test.impl.execution.ClientBeforeAfterLifecycleEventExecuter.execute(ClientBeforeAfterLifecycleEventExecuter.java:99)
      	at org.jboss.arquillian.container.test.impl.execution.ClientBeforeAfterLifecycleEventExecuter.on(ClientBeforeAfterLifecycleEventExecuter.java:72)
      	at sun.reflect.NativeMethodAccessorImpl.invoke0(Native Method)
      	at sun.reflect.NativeMethodAccessorImpl.invoke(NativeMethodAccessorImpl.java:95)
      	at sun.reflect.DelegatingMethodAccessorImpl.invoke(DelegatingMethodAccessorImpl.java:55)
      	at java.lang.reflect.Method.invoke(Method.java:507)
      	at org.jboss.arquillian.core.impl.ObserverImpl.invoke(ObserverImpl.java:94)
      	at org.jboss.arquillian.core.impl.EventContextImpl.invokeObservers(EventContextImpl.java:99)
      	at org.jboss.arquillian.core.impl.EventContextImpl.proceed(EventContextImpl.java:81)
      	at org.jboss.arquillian.container.test.impl.client.ContainerEventController.createContext(ContainerEventController.java:142)
      	at org.jboss.arquillian.container.test.impl.client.ContainerEventController.createBeforeContext(ContainerEventController.java:124)
      	at sun.reflect.NativeMethodAccessorImpl.invoke0(Native Method)
      	at sun.reflect.NativeMethodAccessorImpl.invoke(NativeMethodAccessorImpl.java:95)
      	at sun.reflect.DelegatingMethodAccessorImpl.invoke(DelegatingMethodAccessorImpl.java:55)
      	at java.lang.reflect.Method.invoke(Method.java:507)
      	at org.jboss.arquillian.core.impl.ObserverImpl.invoke(ObserverImpl.java:94)
      	at org.jboss.arquillian.core.impl.EventContextImpl.proceed(EventContextImpl.java:88)
      	at org.jboss.arquillian.test.impl.TestContextHandler.createTestContext(TestContextHandler.java:130)
      	at sun.reflect.GeneratedMethodAccessor7.invoke(Unknown Source)
      	at sun.reflect.DelegatingMethodAccessorImpl.invoke(DelegatingMethodAccessorImpl.java:55)
      	at java.lang.reflect.Method.invoke(Method.java:507)
      	at org.jboss.arquillian.core.impl.ObserverImpl.invoke(ObserverImpl.java:94)
      	at org.jboss.arquillian.core.impl.EventContextImpl.proceed(EventContextImpl.java:88)
      	at org.jboss.arquillian.test.impl.TestContextHandler.createClassContext(TestContextHandler.java:92)
      	at sun.reflect.GeneratedMethodAccessor6.invoke(Unknown Source)
      	at sun.reflect.DelegatingMethodAccessorImpl.invoke(DelegatingMethodAccessorImpl.java:55)
      	at java.lang.reflect.Method.invoke(Method.java:507)
      	at org.jboss.arquillian.core.impl.ObserverImpl.invoke(ObserverImpl.java:94)
      	at org.jboss.arquillian.core.impl.EventContextImpl.proceed(EventContextImpl.java:88)
      	at org.jboss.arquillian.test.impl.TestContextHandler.createSuiteContext(TestContextHandler.java:73)
      	at sun.reflect.GeneratedMethodAccessor5.invoke(Unknown Source)
      	at sun.reflect.DelegatingMethodAccessorImpl.invoke(DelegatingMethodAccessorImpl.java:55)
      	at java.lang.reflect.Method.invoke(Method.java:507)
      	at org.jboss.arquillian.core.impl.ObserverImpl.invoke(ObserverImpl.java:94)
      	at org.jboss.arquillian.core.impl.EventContextImpl.proceed(EventContextImpl.java:88)
      	at org.jboss.arquillian.core.impl.ManagerImpl.fire(ManagerImpl.java:145)
      	at org.jboss.arquillian.core.impl.ManagerImpl.fire(ManagerImpl.java:116)
      	at org.jboss.arquillian.test.impl.EventTestRunnerAdaptor.fireCustomLifecycle(EventTestRunnerAdaptor.java:159)
      	at org.jboss.arquillian.junit.Arquillian$7.evaluate(Arquillian.java:311)
      	at org.junit.runners.ParentRunner.runLeaf(ParentRunner.java:271)
      	at org.junit.runners.BlockJUnit4ClassRunner.runChild(BlockJUnit4ClassRunner.java:70)
      	at org.junit.runners.BlockJUnit4ClassRunner.runChild(BlockJUnit4ClassRunner.java:50)
      	at org.junit.runners.ParentRunner$3.run(ParentRunner.java:238)
      	at org.junit.runners.ParentRunner$1.schedule(ParentRunner.java:63)
      	at org.junit.runners.ParentRunner.runChildren(ParentRunner.java:236)
      	at org.junit.runners.ParentRunner.access$000(ParentRunner.java:53)
      	at org.junit.runners.ParentRunner$2.evaluate(ParentRunner.java:229)
      	at org.jboss.arquillian.junit.Arquillian$2.evaluate(Arquillian.java:204)
      	at org.jboss.arquillian.junit.Arquillian.multiExecute(Arquillian.java:422)
      	at org.jboss.arquillian.junit.Arquillian.access$200(Arquillian.java:54)
      	at org.jboss.arquillian.junit.Arquillian$3.evaluate(Arquillian.java:218)
      	at org.junit.runners.ParentRunner.run(ParentRunner.java:309)
      	at org.jboss.arquillian.junit.Arquillian.run(Arquillian.java:166)
      	at org.apache.maven.surefire.junit4.JUnit4Provider.execute(JUnit4Provider.java:264)
      	at org.apache.maven.surefire.junit4.JUnit4Provider.executeTestSet(JUnit4Provider.java:153)
      	at org.apache.maven.surefire.junit4.JUnit4Provider.invoke(JUnit4Provider.java:124)
      	at sun.reflect.NativeMethodAccessorImpl.invoke0(Native Method)
      	at sun.reflect.NativeMethodAccessorImpl.invoke(NativeMethodAccessorImpl.java:95)
      	at sun.reflect.DelegatingMethodAccessorImpl.invoke(DelegatingMethodAccessorImpl.java:55)
      	at java.lang.reflect.Method.invoke(Method.java:507)
      	at org.apache.maven.surefire.util.ReflectionUtils.invokeMethodWithArray2(ReflectionUtils.java:208)
      	at org.apache.maven.surefire.booter.ProviderFactory$ProviderProxy.invoke(ProviderFactory.java:159)
      	at org.apache.maven.surefire.booter.ProviderFactory.invokeProvider(ProviderFactory.java:87)
      	at org.apache.maven.surefire.booter.ForkedBooter.runSuitesInProcess(ForkedBooter.java:153)
      	at org.apache.maven.surefire.booter.ForkedBooter.main(ForkedBooter.java:95)
      

        Gliffy Diagrams

          Attachments

            Issue Links

              Activity

                People

                • Assignee:
                  mmusgrov Michael Musgrove
                  Reporter:
                  gytis Gytis Trikleris
                • Votes:
                  0 Vote for this issue
                  Watchers:
                  2 Start watching this issue

                  Dates

                  • Created:
                    Updated:
                    Resolved: