Uploaded image for project: 'JBoss Transaction Manager'
  1. JBoss Transaction Manager
  2. JBTM-2416

OSGiJTATest #testTransactionManager failed

    Details

    • Type: Bug
    • Status: Closed (View Workflow)
    • Priority: Minor
    • Resolution: Out of Date
    • Affects Version/s: None
    • Fix Version/s: None
    • Component/s: JTA
    • Labels:
      None

      Description

      http://albany.eng.hst.ams2.redhat.com/view/Status/job/narayana/837/PROFILE=MAIN,jdk=jdk8.latest,label=linux/console

      Running org.jboss.narayana.osgi.jta.OSGiJTATest
      Tests run: 1, Failures: 1, Errors: 0, Skipped: 0, Time elapsed: 17.09 sec <<< FAILURE!
      testTransactionManager(org.jboss.narayana.osgi.jta.OSGiJTATest)  Time elapsed: 0.003 sec  <<< FAILURE!
      java.lang.AssertionError: Bundle ACTIVE expected:<32> but was:<4>
      	at org.junit.Assert.fail(Assert.java:88)
      	at org.junit.Assert.failNotEquals(Assert.java:743)
      	at org.junit.Assert.assertEquals(Assert.java:118)
      	at org.junit.Assert.assertEquals(Assert.java:555)
      	at org.jboss.narayana.osgi.jta.OSGiJTATest.testTransactionManager(OSGiJTATest.java:81)
      

        Gliffy Diagrams

          Attachments

            Activity

              People

              • Assignee:
                zhfeng Zheng Feng
                Reporter:
                gytis gytis
              • Votes:
                0 Vote for this issue
                Watchers:
                2 Start watching this issue

                Dates

                • Created:
                  Updated:
                  Resolved: