Uploaded image for project: 'JBoss Transaction Manager'
  1. JBoss Transaction Manager
  2. JBTM-2333

Blacktie subsystem build fails, because of missing org.jacorb module

    XMLWordPrintable

    Details

      Description

      http://albany.eng.hst.ams2.redhat.com/view/Status/job/narayana/731/

      [ERROR] Failed to execute goal org.wildfly.build:wildfly-feature-pack-build-maven-plugin:1.0.0.Alpha8:build (feature-pack-build) on project wildfly-blacktie-feature-pack: Execution feature-pack-build of goal org.wildfly.build:wildfly-feature-pack-build-maven-plugin:1.0.0.Alpha8:build failed: java.lang.RuntimeException: Some errors were encountered creating the feature pack
      [ERROR] Missing module ModuleIdentifier{name='org.jacorb', slot='main'}. Module was required by [ModuleIdentifier{name='org.wildfly.extension.blacktie', slot='main'}]
      [ERROR] -> [Help 1]
      

        Gliffy Diagrams

          Attachments

            Issue Links

              Activity

                People

                • Assignee:
                  zhfeng Zheng Feng
                  Reporter:
                  gytis Gytis Trikleris
                • Votes:
                  0 Vote for this issue
                  Watchers:
                  0 Start watching this issue

                  Dates

                  • Created:
                    Updated:
                    Resolved: