Uploaded image for project: 'JBoss Transaction Manager'
  1. JBoss Transaction Manager
  2. JBTM-2205

Mandatory transaction is missing in travel agent compensations quickstart

    XMLWordPrintable

    Details

      Description

      http://172.17.131.2/view/Narayana+BlackTie/job/narayana-quickstarts/79

      -------------------------------------------------------------------------------
      Test set: org.jboss.narayana.quickstarts.compensationsApi.hotel.HotelBookingTest
      -------------------------------------------------------------------------------
      Tests run: 2, Failures: 0, Errors: 2, Skipped: 0, Time elapsed: 5.398 sec <<< FAILURE!
      testSuccess(org.jboss.narayana.quickstarts.compensationsApi.hotel.HotelBookingTest)  Time elapsed: 0.434 sec  <<< ERROR!
      java.lang.IllegalStateException: Error launching test org.jboss.narayana.quickstarts.compensationsApi.hotel.HotelBookingTest public void org.jboss.narayana.quickstarts.compensationsApi.hotel.HotelBookingTest.testSuccess() throws java.lang.Exception
      	at org.jboss.arquillian.protocol.servlet.ServletMethodExecutor.invoke(ServletMethodExecutor.java:126)
      	at org.jboss.arquillian.container.test.impl.execution.RemoteTestExecuter.execute(RemoteTestExecuter.java:120)
      	at sun.reflect.NativeMethodAccessorImpl.invoke0(Native Method)
      	at sun.reflect.NativeMethodAccessorImpl.invoke(NativeMethodAccessorImpl.java:57)
      	at sun.reflect.DelegatingMethodAccessorImpl.invoke(DelegatingMethodAccessorImpl.java:43)
      	at java.lang.reflect.Method.invoke(Method.java:606)
      	at org.jboss.arquillian.core.impl.ObserverImpl.invoke(ObserverImpl.java:90)
      	at org.jboss.arquillian.core.impl.EventContextImpl.invokeObservers(EventContextImpl.java:99)
      	at org.jboss.arquillian.core.impl.EventContextImpl.proceed(EventContextImpl.java:81)
      	at org.jboss.arquillian.core.impl.ManagerImpl.fire(ManagerImpl.java:135)
      	at org.jboss.arquillian.core.impl.ManagerImpl.fire(ManagerImpl.java:115)
      	at org.jboss.arquillian.core.impl.EventImpl.fire(EventImpl.java:67)
      	at org.jboss.arquillian.container.test.impl.execution.ClientTestExecuter.execute(ClientTestExecuter.java:57)
      	at sun.reflect.NativeMethodAccessorImpl.invoke0(Native Method)
      	at sun.reflect.NativeMethodAccessorImpl.invoke(NativeMethodAccessorImpl.java:57)
      	at sun.reflect.DelegatingMethodAccessorImpl.invoke(DelegatingMethodAccessorImpl.java:43)
      	at java.lang.reflect.Method.invoke(Method.java:606)
      	at org.jboss.arquillian.core.impl.ObserverImpl.invoke(ObserverImpl.java:90)
      	at org.jboss.arquillian.core.impl.EventContextImpl.invokeObservers(EventContextImpl.java:99)
      	at org.jboss.arquillian.core.impl.EventContextImpl.proceed(EventContextImpl.java:81)
      	at org.jboss.arquillian.container.test.impl.client.ContainerEventController.createContext(ContainerEventController.java:142)
      	at org.jboss.arquillian.container.test.impl.client.ContainerEventController.createTestContext(ContainerEventController.java:129)
      	at sun.reflect.NativeMethodAccessorImpl.invoke0(Native Method)
      	at sun.reflect.NativeMethodAccessorImpl.invoke(NativeMethodAccessorImpl.java:57)
      	at sun.reflect.DelegatingMethodAccessorImpl.invoke(DelegatingMethodAccessorImpl.java:43)
      	at java.lang.reflect.Method.invoke(Method.java:606)
      	at org.jboss.arquillian.core.impl.ObserverImpl.invoke(ObserverImpl.java:90)
      	at org.jboss.arquillian.core.impl.EventContextImpl.proceed(EventContextImpl.java:88)
      	at org.jboss.arquillian.test.impl.TestContextHandler.createTestContext(TestContextHandler.java:89)
      	at sun.reflect.NativeMethodAccessorImpl.invoke0(Native Method)
      	at sun.reflect.NativeMethodAccessorImpl.invoke(NativeMethodAccessorImpl.java:57)
      	at sun.reflect.DelegatingMethodAccessorImpl.invoke(DelegatingMethodAccessorImpl.java:43)
      	at java.lang.reflect.Method.invoke(Method.java:606)
      	at org.jboss.arquillian.core.impl.ObserverImpl.invoke(ObserverImpl.java:90)
      	at org.jboss.arquillian.core.impl.EventContextImpl.proceed(EventContextImpl.java:88)
      	at org.jboss.arquillian.test.impl.TestContextHandler.createClassContext(TestContextHandler.java:75)
      	at sun.reflect.NativeMethodAccessorImpl.invoke0(Native Method)
      	at sun.reflect.NativeMethodAccessorImpl.invoke(NativeMethodAccessorImpl.java:57)
      	at sun.reflect.DelegatingMethodAccessorImpl.invoke(DelegatingMethodAccessorImpl.java:43)
      	at java.lang.reflect.Method.invoke(Method.java:606)
      	at org.jboss.arquillian.core.impl.ObserverImpl.invoke(ObserverImpl.java:90)
      	at org.jboss.arquillian.core.impl.EventContextImpl.proceed(EventContextImpl.java:88)
      	at org.jboss.arquillian.test.impl.TestContextHandler.createSuiteContext(TestContextHandler.java:60)
      	at sun.reflect.NativeMethodAccessorImpl.invoke0(Native Method)
      	at sun.reflect.NativeMethodAccessorImpl.invoke(NativeMethodAccessorImpl.java:57)
      	at sun.reflect.DelegatingMethodAccessorImpl.invoke(DelegatingMethodAccessorImpl.java:43)
      	at java.lang.reflect.Method.invoke(Method.java:606)
      	at org.jboss.arquillian.core.impl.ObserverImpl.invoke(ObserverImpl.java:90)
      	at org.jboss.arquillian.core.impl.EventContextImpl.proceed(EventContextImpl.java:88)
      	at org.jboss.arquillian.core.impl.ManagerImpl.fire(ManagerImpl.java:135)
      	at org.jboss.arquillian.test.impl.EventTestRunnerAdaptor.test(EventTestRunnerAdaptor.java:111)
      	at org.jboss.arquillian.junit.Arquillian$6.evaluate(Arquillian.java:263)
      	at org.jboss.arquillian.junit.Arquillian$4.evaluate(Arquillian.java:226)
      	at org.jboss.arquillian.junit.Arquillian.multiExecute(Arquillian.java:314)
      	at org.jboss.arquillian.junit.Arquillian.access$100(Arquillian.java:46)
      	at org.jboss.arquillian.junit.Arquillian$5.evaluate(Arquillian.java:240)
      	at org.junit.runners.ParentRunner.runLeaf(ParentRunner.java:263)
      	at org.junit.runners.BlockJUnit4ClassRunner.runChild(BlockJUnit4ClassRunner.java:68)
      	at org.junit.runners.BlockJUnit4ClassRunner.runChild(BlockJUnit4ClassRunner.java:47)
      	at org.junit.runners.ParentRunner$3.run(ParentRunner.java:231)
      	at org.junit.runners.ParentRunner$1.schedule(ParentRunner.java:60)
      	at org.junit.runners.ParentRunner.runChildren(ParentRunner.java:229)
      	at org.junit.runners.ParentRunner.access$000(ParentRunner.java:50)
      	at org.junit.runners.ParentRunner$2.evaluate(ParentRunner.java:222)
      	at org.jboss.arquillian.junit.Arquillian$2.evaluate(Arquillian.java:185)
      	at org.jboss.arquillian.junit.Arquillian.multiExecute(Arquillian.java:314)
      	at org.jboss.arquillian.junit.Arquillian.access$100(Arquillian.java:46)
      	at org.jboss.arquillian.junit.Arquillian$3.evaluate(Arquillian.java:199)
      	at org.junit.runners.ParentRunner.run(ParentRunner.java:300)
      	at org.jboss.arquillian.junit.Arquillian.run(Arquillian.java:147)
      	at org.apache.maven.surefire.junit4.JUnit4TestSet.execute(JUnit4TestSet.java:53)
      	at org.apache.maven.surefire.junit4.JUnit4Provider.executeTestSet(JUnit4Provider.java:123)
      	at org.apache.maven.surefire.junit4.JUnit4Provider.invoke(JUnit4Provider.java:104)
      	at sun.reflect.NativeMethodAccessorImpl.invoke0(Native Method)
      	at sun.reflect.NativeMethodAccessorImpl.invoke(NativeMethodAccessorImpl.java:57)
      	at sun.reflect.DelegatingMethodAccessorImpl.invoke(DelegatingMethodAccessorImpl.java:43)
      	at java.lang.reflect.Method.invoke(Method.java:606)
      	at org.apache.maven.surefire.util.ReflectionUtils.invokeMethodWithArray(ReflectionUtils.java:164)
      	at org.apache.maven.surefire.booter.ProviderFactory$ProviderProxy.invoke(ProviderFactory.java:110)
      	at org.apache.maven.surefire.booter.SurefireStarter.invokeProvider(SurefireStarter.java:172)
      	at org.apache.maven.surefire.booter.SurefireStarter.runSuitesInProcessWhenForked(SurefireStarter.java:104)
      	at org.apache.maven.surefire.booter.ForkedBooter.main(ForkedBooter.java:70)
      Caused by: java.io.WriteAbortedException: writing aborted; java.io.NotSerializableException: com.sun.xml.messaging.saaj.soap.ver1_1.SOAPPart1_1Impl
      	at java.io.ObjectInputStream.readObject0(ObjectInputStream.java:1354)
      	at java.io.ObjectInputStream.readObject(ObjectInputStream.java:370)
      	at org.jboss.arquillian.test.spi.ExceptionProxy.readExternal(ExceptionProxy.java:177)
      	at java.io.ObjectInputStream.readExternalData(ObjectInputStream.java:1837)
      	at java.io.ObjectInputStream.readOrdinaryObject(ObjectInputStream.java:1796)
      	at java.io.ObjectInputStream.readObject0(ObjectInputStream.java:1350)
      	at java.io.ObjectInputStream.defaultReadFields(ObjectInputStream.java:1990)
      	at java.io.ObjectInputStream.readSerialData(ObjectInputStream.java:1915)
      	at java.io.ObjectInputStream.readOrdinaryObject(ObjectInputStream.java:1798)
      	at java.io.ObjectInputStream.readObject0(ObjectInputStream.java:1350)
      	at java.io.ObjectInputStream.readObject(ObjectInputStream.java:370)
      	at org.jboss.arquillian.protocol.servlet.ServletMethodExecutor.execute(ServletMethodExecutor.java:218)
      	at org.jboss.arquillian.protocol.servlet.ServletMethodExecutor.executeWithRetry(ServletMethodExecutor.java:144)
      	at org.jboss.arquillian.protocol.servlet.ServletMethodExecutor.invoke(ServletMethodExecutor.java:122)
      	... 81 more
      Caused by: java.io.NotSerializableException: com.sun.xml.messaging.saaj.soap.ver1_1.SOAPPart1_1Impl
      	at java.io.ObjectOutputStream.writeObject0(ObjectOutputStream.java:1183)
      	at java.io.ObjectOutputStream.defaultWriteFields(ObjectOutputStream.java:1547)
      	at java.io.ObjectOutputStream.writeSerialData(ObjectOutputStream.java:1508)
      	at java.io.ObjectOutputStream.writeOrdinaryObject(ObjectOutputStream.java:1431)
      	at java.io.ObjectOutputStream.writeObject0(ObjectOutputStream.java:1177)
      	at java.io.ObjectOutputStream.defaultWriteFields(ObjectOutputStream.java:1547)
      	at java.io.ObjectOutputStream.defaultWriteObject(ObjectOutputStream.java:440)
      	at org.apache.xerces.dom.NodeImpl.writeObject(Unknown Source)
      	at sun.reflect.NativeMethodAccessorImpl.invoke0(Native Method)
      	at sun.reflect.NativeMethodAccessorImpl.invoke(NativeMethodAccessorImpl.java:57)
      	at sun.reflect.DelegatingMethodAccessorImpl.invoke(DelegatingMethodAccessorImpl.java:43)
      	at java.lang.reflect.Method.invoke(Method.java:606)
      	at java.io.ObjectStreamClass.invokeWriteObject(ObjectStreamClass.java:988)
      	at java.io.ObjectOutputStream.writeSerialData(ObjectOutputStream.java:1495)
      	at java.io.ObjectOutputStream.writeOrdinaryObject(ObjectOutputStream.java:1431)
      	at java.io.ObjectOutputStream.writeObject0(ObjectOutputStream.java:1177)
      	at java.io.ObjectOutputStream.defaultWriteFields(ObjectOutputStream.java:1547)
      	at java.io.ObjectOutputStream.writeSerialData(ObjectOutputStream.java:1508)
      	at java.io.ObjectOutputStream.writeOrdinaryObject(ObjectOutputStream.java:1431)
      	at java.io.ObjectOutputStream.writeObject0(ObjectOutputStream.java:1177)
      	at java.io.ObjectOutputStream.writeObject(ObjectOutputStream.java:347)
      	at org.jboss.arquillian.test.spi.ExceptionProxy.writeExternal(ExceptionProxy.java:227)
      	at java.io.ObjectOutputStream.writeExternalData(ObjectOutputStream.java:1458)
      	at java.io.ObjectOutputStream.writeOrdinaryObject(ObjectOutputStream.java:1429)
      	at java.io.ObjectOutputStream.writeObject0(ObjectOutputStream.java:1177)
      	at java.io.ObjectOutputStream.defaultWriteFields(ObjectOutputStream.java:1547)
      	at java.io.ObjectOutputStream.writeSerialData(ObjectOutputStream.java:1508)
      	at java.io.ObjectOutputStream.writeOrdinaryObject(ObjectOutputStream.java:1431)
      	at java.io.ObjectOutputStream.writeObject0(ObjectOutputStream.java:1177)
      	at java.io.ObjectOutputStream.writeObject(ObjectOutputStream.java:347)
      	at org.jboss.arquillian.protocol.servlet.runner.ServletTestRunner.writeObject(ServletTestRunner.java:229)
      	at org.jboss.arquillian.protocol.servlet.runner.ServletTestRunner.executeTest(ServletTestRunner.java:163)
      	at org.jboss.arquillian.protocol.servlet.runner.ServletTestRunner.execute(ServletTestRunner.java:126)
      	at org.jboss.arquillian.protocol.servlet.runner.ServletTestRunner.doGet(ServletTestRunner.java:90)
      	at javax.servlet.http.HttpServlet.service(HttpServlet.java:687)
      	at javax.servlet.http.HttpServlet.service(HttpServlet.java:790)
      	at io.undertow.servlet.handlers.ServletHandler.handleRequest(ServletHandler.java:85)
      	at io.undertow.servlet.handlers.security.ServletSecurityRoleHandler.handleRequest(ServletSecurityRoleHandler.java:61)
      	at io.undertow.servlet.handlers.ServletDispatchingHandler.handleRequest(ServletDispatchingHandler.java:36)
      	at org.wildfly.extension.undertow.security.SecurityContextAssociationHandler.handleRequest(SecurityContextAssociationHandler.java:78)
      	at io.undertow.server.handlers.PredicateHandler.handleRequest(PredicateHandler.java:43)
      	at io.undertow.servlet.handlers.security.SSLInformationAssociationHandler.handleRequest(SSLInformationAssociationHandler.java:131)
      	at io.undertow.servlet.handlers.security.ServletAuthenticationCallHandler.handleRequest(ServletAuthenticationCallHandler.java:56)
      	at io.undertow.server.handlers.PredicateHandler.handleRequest(PredicateHandler.java:43)
      	at io.undertow.security.handlers.AbstractConfidentialityHandler.handleRequest(AbstractConfidentialityHandler.java:45)
      	at io.undertow.servlet.handlers.security.ServletConfidentialityConstraintHandler.handleRequest(ServletConfidentialityConstraintHandler.java:61)
      	at io.undertow.security.handlers.AuthenticationMechanismsHandler.handleRequest(AuthenticationMechanismsHandler.java:58)
      	at io.undertow.servlet.handlers.security.CachedAuthenticatedSessionHandler.handleRequest(CachedAuthenticatedSessionHandler.java:70)
      	at io.undertow.security.handlers.SecurityInitialHandler.handleRequest(SecurityInitialHandler.java:76)
      	at io.undertow.server.handlers.PredicateHandler.handleRequest(PredicateHandler.java:43)
      	at org.wildfly.extension.undertow.security.jacc.JACCContextIdHandler.handleRequest(JACCContextIdHandler.java:61)
      	at io.undertow.server.handlers.PredicateHandler.handleRequest(PredicateHandler.java:43)
      	at io.undertow.server.handlers.PredicateHandler.handleRequest(PredicateHandler.java:43)
      	at io.undertow.servlet.handlers.ServletInitialHandler.handleFirstRequest(ServletInitialHandler.java:243)
      	at io.undertow.servlet.handlers.ServletInitialHandler.dispatchRequest(ServletInitialHandler.java:230)
      	at io.undertow.servlet.handlers.ServletInitialHandler.access$000(ServletInitialHandler.java:76)
      	at io.undertow.servlet.handlers.ServletInitialHandler$1.handleRequest(ServletInitialHandler.java:149)
      	at io.undertow.server.Connectors.executeRootHandler(Connectors.java:195)
      	at io.undertow.server.HttpServerExchange$1.run(HttpServerExchange.java:733)
      	at java.util.concurrent.ThreadPoolExecutor.runWorker(ThreadPoolExecutor.java:1145)
      	at java.util.concurrent.ThreadPoolExecutor$Worker.run(ThreadPoolExecutor.java:615)
      	at java.lang.Thread.run(Thread.java:744)
      testCancel(org.jboss.narayana.quickstarts.compensationsApi.hotel.HotelBookingTest)  Time elapsed: 0.332 sec  <<< ERROR!
      java.lang.IllegalStateException: Error launching test org.jboss.narayana.quickstarts.compensationsApi.hotel.HotelBookingTest public void org.jboss.narayana.quickstarts.compensationsApi.hotel.HotelBookingTest.testCancel() throws java.lang.Exception
      	at org.jboss.arquillian.protocol.servlet.ServletMethodExecutor.invoke(ServletMethodExecutor.java:126)
      	at org.jboss.arquillian.container.test.impl.execution.RemoteTestExecuter.execute(RemoteTestExecuter.java:120)
      	at sun.reflect.NativeMethodAccessorImpl.invoke0(Native Method)
      	at sun.reflect.NativeMethodAccessorImpl.invoke(NativeMethodAccessorImpl.java:57)
      	at sun.reflect.DelegatingMethodAccessorImpl.invoke(DelegatingMethodAccessorImpl.java:43)
      	at java.lang.reflect.Method.invoke(Method.java:606)
      	at org.jboss.arquillian.core.impl.ObserverImpl.invoke(ObserverImpl.java:90)
      	at org.jboss.arquillian.core.impl.EventContextImpl.invokeObservers(EventContextImpl.java:99)
      	at org.jboss.arquillian.core.impl.EventContextImpl.proceed(EventContextImpl.java:81)
      	at org.jboss.arquillian.core.impl.ManagerImpl.fire(ManagerImpl.java:135)
      	at org.jboss.arquillian.core.impl.ManagerImpl.fire(ManagerImpl.java:115)
      	at org.jboss.arquillian.core.impl.EventImpl.fire(EventImpl.java:67)
      	at org.jboss.arquillian.container.test.impl.execution.ClientTestExecuter.execute(ClientTestExecuter.java:57)
      	at sun.reflect.NativeMethodAccessorImpl.invoke0(Native Method)
      	at sun.reflect.NativeMethodAccessorImpl.invoke(NativeMethodAccessorImpl.java:57)
      	at sun.reflect.DelegatingMethodAccessorImpl.invoke(DelegatingMethodAccessorImpl.java:43)
      	at java.lang.reflect.Method.invoke(Method.java:606)
      	at org.jboss.arquillian.core.impl.ObserverImpl.invoke(ObserverImpl.java:90)
      	at org.jboss.arquillian.core.impl.EventContextImpl.invokeObservers(EventContextImpl.java:99)
      	at org.jboss.arquillian.core.impl.EventContextImpl.proceed(EventContextImpl.java:81)
      	at org.jboss.arquillian.container.test.impl.client.ContainerEventController.createContext(ContainerEventController.java:142)
      	at org.jboss.arquillian.container.test.impl.client.ContainerEventController.createTestContext(ContainerEventController.java:129)
      	at sun.reflect.NativeMethodAccessorImpl.invoke0(Native Method)
      	at sun.reflect.NativeMethodAccessorImpl.invoke(NativeMethodAccessorImpl.java:57)
      	at sun.reflect.DelegatingMethodAccessorImpl.invoke(DelegatingMethodAccessorImpl.java:43)
      	at java.lang.reflect.Method.invoke(Method.java:606)
      	at org.jboss.arquillian.core.impl.ObserverImpl.invoke(ObserverImpl.java:90)
      	at org.jboss.arquillian.core.impl.EventContextImpl.proceed(EventContextImpl.java:88)
      	at org.jboss.arquillian.test.impl.TestContextHandler.createTestContext(TestContextHandler.java:89)
      	at sun.reflect.NativeMethodAccessorImpl.invoke0(Native Method)
      	at sun.reflect.NativeMethodAccessorImpl.invoke(NativeMethodAccessorImpl.java:57)
      	at sun.reflect.DelegatingMethodAccessorImpl.invoke(DelegatingMethodAccessorImpl.java:43)
      	at java.lang.reflect.Method.invoke(Method.java:606)
      	at org.jboss.arquillian.core.impl.ObserverImpl.invoke(ObserverImpl.java:90)
      	at org.jboss.arquillian.core.impl.EventContextImpl.proceed(EventContextImpl.java:88)
      	at org.jboss.arquillian.test.impl.TestContextHandler.createClassContext(TestContextHandler.java:75)
      	at sun.reflect.NativeMethodAccessorImpl.invoke0(Native Method)
      	at sun.reflect.NativeMethodAccessorImpl.invoke(NativeMethodAccessorImpl.java:57)
      	at sun.reflect.DelegatingMethodAccessorImpl.invoke(DelegatingMethodAccessorImpl.java:43)
      	at java.lang.reflect.Method.invoke(Method.java:606)
      	at org.jboss.arquillian.core.impl.ObserverImpl.invoke(ObserverImpl.java:90)
      	at org.jboss.arquillian.core.impl.EventContextImpl.proceed(EventContextImpl.java:88)
      	at org.jboss.arquillian.test.impl.TestContextHandler.createSuiteContext(TestContextHandler.java:60)
      	at sun.reflect.NativeMethodAccessorImpl.invoke0(Native Method)
      	at sun.reflect.NativeMethodAccessorImpl.invoke(NativeMethodAccessorImpl.java:57)
      	at sun.reflect.DelegatingMethodAccessorImpl.invoke(DelegatingMethodAccessorImpl.java:43)
      	at java.lang.reflect.Method.invoke(Method.java:606)
      	at org.jboss.arquillian.core.impl.ObserverImpl.invoke(ObserverImpl.java:90)
      	at org.jboss.arquillian.core.impl.EventContextImpl.proceed(EventContextImpl.java:88)
      	at org.jboss.arquillian.core.impl.ManagerImpl.fire(ManagerImpl.java:135)
      	at org.jboss.arquillian.test.impl.EventTestRunnerAdaptor.test(EventTestRunnerAdaptor.java:111)
      	at org.jboss.arquillian.junit.Arquillian$6.evaluate(Arquillian.java:263)
      	at org.jboss.arquillian.junit.Arquillian$4.evaluate(Arquillian.java:226)
      	at org.jboss.arquillian.junit.Arquillian.multiExecute(Arquillian.java:314)
      	at org.jboss.arquillian.junit.Arquillian.access$100(Arquillian.java:46)
      	at org.jboss.arquillian.junit.Arquillian$5.evaluate(Arquillian.java:240)
      	at org.junit.runners.ParentRunner.runLeaf(ParentRunner.java:263)
      	at org.junit.runners.BlockJUnit4ClassRunner.runChild(BlockJUnit4ClassRunner.java:68)
      	at org.junit.runners.BlockJUnit4ClassRunner.runChild(BlockJUnit4ClassRunner.java:47)
      	at org.junit.runners.ParentRunner$3.run(ParentRunner.java:231)
      	at org.junit.runners.ParentRunner$1.schedule(ParentRunner.java:60)
      	at org.junit.runners.ParentRunner.runChildren(ParentRunner.java:229)
      	at org.junit.runners.ParentRunner.access$000(ParentRunner.java:50)
      	at org.junit.runners.ParentRunner$2.evaluate(ParentRunner.java:222)
      	at org.jboss.arquillian.junit.Arquillian$2.evaluate(Arquillian.java:185)
      	at org.jboss.arquillian.junit.Arquillian.multiExecute(Arquillian.java:314)
      	at org.jboss.arquillian.junit.Arquillian.access$100(Arquillian.java:46)
      	at org.jboss.arquillian.junit.Arquillian$3.evaluate(Arquillian.java:199)
      	at org.junit.runners.ParentRunner.run(ParentRunner.java:300)
      	at org.jboss.arquillian.junit.Arquillian.run(Arquillian.java:147)
      	at org.apache.maven.surefire.junit4.JUnit4TestSet.execute(JUnit4TestSet.java:53)
      	at org.apache.maven.surefire.junit4.JUnit4Provider.executeTestSet(JUnit4Provider.java:123)
      	at org.apache.maven.surefire.junit4.JUnit4Provider.invoke(JUnit4Provider.java:104)
      	at sun.reflect.NativeMethodAccessorImpl.invoke0(Native Method)
      	at sun.reflect.NativeMethodAccessorImpl.invoke(NativeMethodAccessorImpl.java:57)
      	at sun.reflect.DelegatingMethodAccessorImpl.invoke(DelegatingMethodAccessorImpl.java:43)
      	at java.lang.reflect.Method.invoke(Method.java:606)
      	at org.apache.maven.surefire.util.ReflectionUtils.invokeMethodWithArray(ReflectionUtils.java:164)
      	at org.apache.maven.surefire.booter.ProviderFactory$ProviderProxy.invoke(ProviderFactory.java:110)
      	at org.apache.maven.surefire.booter.SurefireStarter.invokeProvider(SurefireStarter.java:172)
      	at org.apache.maven.surefire.booter.SurefireStarter.runSuitesInProcessWhenForked(SurefireStarter.java:104)
      	at org.apache.maven.surefire.booter.ForkedBooter.main(ForkedBooter.java:70)
      Caused by: java.io.WriteAbortedException: writing aborted; java.io.NotSerializableException: com.sun.xml.messaging.saaj.soap.ver1_1.SOAPPart1_1Impl
      	at java.io.ObjectInputStream.readObject0(ObjectInputStream.java:1354)
      	at java.io.ObjectInputStream.readObject(ObjectInputStream.java:370)
      	at org.jboss.arquillian.test.spi.ExceptionProxy.readExternal(ExceptionProxy.java:177)
      	at java.io.ObjectInputStream.readExternalData(ObjectInputStream.java:1837)
      	at java.io.ObjectInputStream.readOrdinaryObject(ObjectInputStream.java:1796)
      	at java.io.ObjectInputStream.readObject0(ObjectInputStream.java:1350)
      	at java.io.ObjectInputStream.defaultReadFields(ObjectInputStream.java:1990)
      	at java.io.ObjectInputStream.readSerialData(ObjectInputStream.java:1915)
      	at java.io.ObjectInputStream.readOrdinaryObject(ObjectInputStream.java:1798)
      	at java.io.ObjectInputStream.readObject0(ObjectInputStream.java:1350)
      	at java.io.ObjectInputStream.readObject(ObjectInputStream.java:370)
      	at org.jboss.arquillian.protocol.servlet.ServletMethodExecutor.execute(ServletMethodExecutor.java:218)
      	at org.jboss.arquillian.protocol.servlet.ServletMethodExecutor.executeWithRetry(ServletMethodExecutor.java:144)
      	at org.jboss.arquillian.protocol.servlet.ServletMethodExecutor.invoke(ServletMethodExecutor.java:122)
      	... 81 more
      Caused by: java.io.NotSerializableException: com.sun.xml.messaging.saaj.soap.ver1_1.SOAPPart1_1Impl
      	at java.io.ObjectOutputStream.writeObject0(ObjectOutputStream.java:1183)
      	at java.io.ObjectOutputStream.defaultWriteFields(ObjectOutputStream.java:1547)
      	at java.io.ObjectOutputStream.writeSerialData(ObjectOutputStream.java:1508)
      	at java.io.ObjectOutputStream.writeOrdinaryObject(ObjectOutputStream.java:1431)
      	at java.io.ObjectOutputStream.writeObject0(ObjectOutputStream.java:1177)
      	at java.io.ObjectOutputStream.defaultWriteFields(ObjectOutputStream.java:1547)
      	at java.io.ObjectOutputStream.defaultWriteObject(ObjectOutputStream.java:440)
      	at org.apache.xerces.dom.NodeImpl.writeObject(Unknown Source)
      	at sun.reflect.NativeMethodAccessorImpl.invoke0(Native Method)
      	at sun.reflect.NativeMethodAccessorImpl.invoke(NativeMethodAccessorImpl.java:57)
      	at sun.reflect.DelegatingMethodAccessorImpl.invoke(DelegatingMethodAccessorImpl.java:43)
      	at java.lang.reflect.Method.invoke(Method.java:606)
      	at java.io.ObjectStreamClass.invokeWriteObject(ObjectStreamClass.java:988)
      	at java.io.ObjectOutputStream.writeSerialData(ObjectOutputStream.java:1495)
      	at java.io.ObjectOutputStream.writeOrdinaryObject(ObjectOutputStream.java:1431)
      	at java.io.ObjectOutputStream.writeObject0(ObjectOutputStream.java:1177)
      	at java.io.ObjectOutputStream.defaultWriteFields(ObjectOutputStream.java:1547)
      	at java.io.ObjectOutputStream.writeSerialData(ObjectOutputStream.java:1508)
      	at java.io.ObjectOutputStream.writeOrdinaryObject(ObjectOutputStream.java:1431)
      	at java.io.ObjectOutputStream.writeObject0(ObjectOutputStream.java:1177)
      	at java.io.ObjectOutputStream.writeObject(ObjectOutputStream.java:347)
      	at org.jboss.arquillian.test.spi.ExceptionProxy.writeExternal(ExceptionProxy.java:227)
      	at java.io.ObjectOutputStream.writeExternalData(ObjectOutputStream.java:1458)
      	at java.io.ObjectOutputStream.writeOrdinaryObject(ObjectOutputStream.java:1429)
      	at java.io.ObjectOutputStream.writeObject0(ObjectOutputStream.java:1177)
      	at java.io.ObjectOutputStream.defaultWriteFields(ObjectOutputStream.java:1547)
      	at java.io.ObjectOutputStream.writeSerialData(ObjectOutputStream.java:1508)
      	at java.io.ObjectOutputStream.writeOrdinaryObject(ObjectOutputStream.java:1431)
      	at java.io.ObjectOutputStream.writeObject0(ObjectOutputStream.java:1177)
      	at java.io.ObjectOutputStream.writeObject(ObjectOutputStream.java:347)
      	at org.jboss.arquillian.protocol.servlet.runner.ServletTestRunner.writeObject(ServletTestRunner.java:229)
      	at org.jboss.arquillian.protocol.servlet.runner.ServletTestRunner.executeTest(ServletTestRunner.java:163)
      	at org.jboss.arquillian.protocol.servlet.runner.ServletTestRunner.execute(ServletTestRunner.java:126)
      	at org.jboss.arquillian.protocol.servlet.runner.ServletTestRunner.doGet(ServletTestRunner.java:90)
      	at javax.servlet.http.HttpServlet.service(HttpServlet.java:687)
      	at javax.servlet.http.HttpServlet.service(HttpServlet.java:790)
      	at io.undertow.servlet.handlers.ServletHandler.handleRequest(ServletHandler.java:85)
      	at io.undertow.servlet.handlers.security.ServletSecurityRoleHandler.handleRequest(ServletSecurityRoleHandler.java:61)
      	at io.undertow.servlet.handlers.ServletDispatchingHandler.handleRequest(ServletDispatchingHandler.java:36)
      	at org.wildfly.extension.undertow.security.SecurityContextAssociationHandler.handleRequest(SecurityContextAssociationHandler.java:78)
      	at io.undertow.server.handlers.PredicateHandler.handleRequest(PredicateHandler.java:43)
      	at io.undertow.servlet.handlers.security.SSLInformationAssociationHandler.handleRequest(SSLInformationAssociationHandler.java:131)
      	at io.undertow.servlet.handlers.security.ServletAuthenticationCallHandler.handleRequest(ServletAuthenticationCallHandler.java:56)
      	at io.undertow.server.handlers.PredicateHandler.handleRequest(PredicateHandler.java:43)
      	at io.undertow.security.handlers.AbstractConfidentialityHandler.handleRequest(AbstractConfidentialityHandler.java:45)
      	at io.undertow.servlet.handlers.security.ServletConfidentialityConstraintHandler.handleRequest(ServletConfidentialityConstraintHandler.java:61)
      	at io.undertow.security.handlers.AuthenticationMechanismsHandler.handleRequest(AuthenticationMechanismsHandler.java:58)
      	at io.undertow.servlet.handlers.security.CachedAuthenticatedSessionHandler.handleRequest(CachedAuthenticatedSessionHandler.java:70)
      	at io.undertow.security.handlers.SecurityInitialHandler.handleRequest(SecurityInitialHandler.java:76)
      	at io.undertow.server.handlers.PredicateHandler.handleRequest(PredicateHandler.java:43)
      	at org.wildfly.extension.undertow.security.jacc.JACCContextIdHandler.handleRequest(JACCContextIdHandler.java:61)
      	at io.undertow.server.handlers.PredicateHandler.handleRequest(PredicateHandler.java:43)
      	at io.undertow.server.handlers.PredicateHandler.handleRequest(PredicateHandler.java:43)
      	at io.undertow.servlet.handlers.ServletInitialHandler.handleFirstRequest(ServletInitialHandler.java:243)
      	at io.undertow.servlet.handlers.ServletInitialHandler.dispatchRequest(ServletInitialHandler.java:230)
      	at io.undertow.servlet.handlers.ServletInitialHandler.access$000(ServletInitialHandler.java:76)
      	at io.undertow.servlet.handlers.ServletInitialHandler$1.handleRequest(ServletInitialHandler.java:149)
      	at io.undertow.server.Connectors.executeRootHandler(Connectors.java:195)
      	at io.undertow.server.HttpServerExchange$1.run(HttpServerExchange.java:733)
      	at java.util.concurrent.ThreadPoolExecutor.runWorker(ThreadPoolExecutor.java:1145)
      	at java.util.concurrent.ThreadPoolExecutor$Worker.run(ThreadPoolExecutor.java:615)
      	at java.lang.Thread.run(Thread.java:744)
      

        Gliffy Diagrams

          Attachments

            Activity

              People

              • Assignee:
                gytis Gytis Trikleris
                Reporter:
                gytis Gytis Trikleris
              • Votes:
                0 Vote for this issue
                Watchers:
                3 Start watching this issue

                Dates

                • Created:
                  Updated:
                  Resolved: