Uploaded image for project: 'JBoss Transaction Manager'
  1. JBoss Transaction Manager
  2. JBTM-2170

Jacoco failed to create QA code coverage report

    XMLWordPrintable

    Details

    • Type: Bug
    • Status: Closed (View Workflow)
    • Priority: Major
    • Resolution: Done
    • Affects Version/s: None
    • Fix Version/s: 5.0.3
    • Component/s: Testing
    • Labels:
      None

      Description

      http://172.17.131.2/view/Narayana+BlackTie/job/narayana-codeCoverage/118

      BUILD SUCCESSFUL
      Total time: 510 minutes 46 seconds
      generating test coverage report
      Buildfile: /home/hudson/workspace/narayana-codeCoverage/qa/run-tests.xml
      
      jacoco-report:
      [jacoco:report] Loading execution data file /home/hudson/workspace/narayana-codeCoverage/qa/testoutput/jacoco-qa.exec
      
      BUILD FAILED
      /home/hudson/workspace/narayana-codeCoverage/qa/run-tests.xml:540: Error while creating report
      
      Total time: 8 seconds
      Buildfile: /home/hudson/workspace/narayana-codeCoverage/qa/run-tests.xml
      
      has-testoutput-output:
      
      testoutput.zip:
           [echo] archiving testoutput to testoutput-jacorb.zip
            [zip] Building zip: /home/hudson/workspace/narayana-codeCoverage/qa/testoutput-jacorb.zip
      
      BUILD SUCCESSFUL
      Total time: 9 seconds
      + rm -rf /home/hudson/.m2/repository/org/jboss/narayana
      + cd qa
      + ant -f run-tests.xml jacoco-report
      Buildfile: /home/hudson/workspace/narayana-codeCoverage/qa/run-tests.xml
      
      jacoco-report:
      [jacoco:report] Loading execution data file /home/hudson/workspace/narayana-codeCoverage/qa/testoutput/jacoco-qa.exec
      
      BUILD FAILED
      /home/hudson/workspace/narayana-codeCoverage/qa/run-tests.xml:540: Error while creating report
      
      Total time: 9 seconds
      Build step 'Execute shell' marked build as failure
      Archiving artifacts
      Sending e-mails to: gtrikler@redhat.com
      Finished: FAILURE
      

        Gliffy Diagrams

          Attachments

            Activity

              People

              • Assignee:
                gytis Gytis Trikleris
                Reporter:
                gytis Gytis Trikleris
              • Votes:
                0 Vote for this issue
                Watchers:
                3 Start watching this issue

                Dates

                • Created:
                  Updated:
                  Resolved: