Uploaded image for project: 'JBoss Transaction Manager'
  1. JBoss Transaction Manager
  2. JBTM-2145

Blacktie subsystem configuration build fails

    Details

      Description

      http://172.17.131.2/view/Narayana+BlackTie/job/narayana-codeCoverage/113

      [INFO] ------------------------------------------------------------------------
      [INFO] Building WildFly: Blacktie Subsystem Build 5.0.2.Final-SNAPSHOT
      [INFO] ------------------------------------------------------------------------
      [INFO] 
      [INFO] --- maven-clean-plugin:2.5:clean (default-clean) @ wildfly-blacktie-build ---
      [INFO] 
      [INFO] --- maven-enforcer-plugin:1.3.1:enforce (enforce-java-version) @ wildfly-blacktie-build ---
      [INFO] 
      [INFO] --- maven-enforcer-plugin:1.3.1:enforce (enforce-maven-version) @ wildfly-blacktie-build ---
      [INFO] 
      [INFO] --- buildnumber-maven-plugin:1.2:create-timestamp (get-build-timestamp) @ wildfly-blacktie-build ---
      [INFO] 
      [INFO] --- buildnumber-maven-plugin:1.2:create (get-scm-revision) @ wildfly-blacktie-build ---
      [INFO] 
      [INFO] --- jacoco-maven-plugin:0.6.3.201306030806:prepare-agent (pre-unit-test) @ wildfly-blacktie-build ---
      [INFO] Skipping JaCoCo for project with packaging type 'pom'
      [INFO] surefireArgLine set to 
      [INFO] 
      [INFO] --- maven-antrun-plugin:1.7:run (build-blacktie-modular-config) @ wildfly-blacktie-build ---
      [INFO] Executing tasks
      
      main:
      
      modules-minimalistic:
           [echo] Initializing module -> org.wildfly.extension.blacktie
          [mkdir] Created dir: /home/hudson/workspace/narayana-codeCoverage/blacktie/wildfly-blacktie/build/target/wildfly-blacktie-build-5.0.2.Final-SNAPSHOT/modules/system/layers/base/org/wildfly/extension/blacktie/main
           [copy] Copying 1 file to /home/hudson/workspace/narayana-codeCoverage/blacktie/wildfly-blacktie/build/target/wildfly-blacktie-build-5.0.2.Final-SNAPSHOT/modules/system/layers/base/org/wildfly/extension/blacktie/main
           [copy] Copying 1 file to /home/hudson/workspace/narayana-codeCoverage/blacktie/wildfly-blacktie/build/target/wildfly-blacktie-build-5.0.2.Final-SNAPSHOT/modules/system/layers/base/org/wildfly/extension/blacktie/main
      [INFO] Executed tasks
      [INFO] 
      [INFO] --- maven-antrun-plugin:1.7:run (generate-blacktie-config) @ wildfly-blacktie-build ---
      [INFO] Executing tasks
      
      main:
      
      generate-configs:
          [mkdir] Created dir: /home/hudson/workspace/narayana-codeCoverage/blacktie/wildfly-blacktie/build/target/wildfly-blacktie-build-5.0.2.Final-SNAPSHOT/docs/examples/configs
           [echo] Merging standalone configuration/standalone/template.xml and /home/hudson/workspace/narayana-codeCoverage/blacktie/wildfly-blacktie/build/src/main/resources/configuration/examples/subsystems-blacktie.xml into /home/hudson/workspace/narayana-codeCoverage/blacktie/wildfly-blacktie/build/target/wildfly-blacktie-build-5.0.2.Final-SNAPSHOT/docs/examples/configs/standalone-blacktie.xml, using StandaloneMain
           [java] java.lang.IllegalStateException: Could not find '[subsystem=../../../../../../jboss-as/build/src/main/resources/configuration/subsystems/threads.xml, supplement=null]' under the base directory '/home/hudson/workspace/narayana-codeCoverage/blacktie/wildfly-blacktie/build/src/main/resources'
           [java] 	at org.apache.tools.ant.taskdefs.ExecuteJava.execute(ExecuteJava.java:194)
           [java] 	at org.apache.tools.ant.taskdefs.Java.run(Java.java:771)
           [java] 	at org.apache.tools.ant.taskdefs.Java.executeJava(Java.java:221)
           [java] 	at org.apache.tools.ant.taskdefs.Java.executeJava(Java.java:135)
           [java] 	at org.apache.tools.ant.taskdefs.Java.execute(Java.java:108)
           [java] 	at org.apache.tools.ant.UnknownElement.execute(UnknownElement.java:291)
           [java] 	at sun.reflect.GeneratedMethodAccessor30.invoke(Unknown Source)
           [java] 	at sun.reflect.DelegatingMethodAccessorImpl.invoke(DelegatingMethodAccessorImpl.java:43)
           [java] 	at java.lang.reflect.Method.invoke(Method.java:601)
           [java] 	at org.apache.tools.ant.dispatch.DispatchUtils.execute(DispatchUtils.java:106)
           [java] 	at org.apache.tools.ant.Task.perform(Task.java:348)
           [java] 	at org.apache.tools.ant.taskdefs.Sequential.execute(Sequential.java:68)
           [java] 	at org.apache.tools.ant.UnknownElement.execute(UnknownElement.java:291)
           [java] 	at sun.reflect.GeneratedMethodAccessor30.invoke(Unknown Source)
           [java] 	at sun.reflect.DelegatingMethodAccessorImpl.invoke(DelegatingMethodAccessorImpl.java:43)
           [java] 	at java.lang.reflect.Method.invoke(Method.java:601)
           [java] 	at org.apache.tools.ant.dispatch.DispatchUtils.execute(DispatchUtils.java:106)
           [java] 	at org.apache.tools.ant.Task.perform(Task.java:348)
           [java] 	at org.apache.tools.ant.taskdefs.MacroInstance.execute(MacroInstance.java:398)
           [java] 	at org.apache.tools.ant.UnknownElement.execute(UnknownElement.java:291)
           [java] 	at sun.reflect.GeneratedMethodAccessor30.invoke(Unknown Source)
           [java] 	at sun.reflect.DelegatingMethodAccessorImpl.invoke(DelegatingMethodAccessorImpl.java:43)
           [java] 	at java.lang.reflect.Method.invoke(Method.java:601)
           [java] 	at org.apache.tools.ant.dispatch.DispatchUtils.execute(DispatchUtils.java:106)
           [java] 	at org.apache.tools.ant.Task.perform(Task.java:348)
           [java] 	at org.apache.tools.ant.taskdefs.Sequential.execute(Sequential.java:68)
           [java] 	at org.apache.tools.ant.UnknownElement.execute(UnknownElement.java:291)
           [java] 	at sun.reflect.GeneratedMethodAccessor30.invoke(Unknown Source)
           [java] 	at sun.reflect.DelegatingMethodAccessorImpl.invoke(DelegatingMethodAccessorImpl.java:43)
           [java] 	at java.lang.reflect.Method.invoke(Method.java:601)
           [java] 	at org.apache.tools.ant.dispatch.DispatchUtils.execute(DispatchUtils.java:106)
           [java] 	at org.apache.tools.ant.Task.perform(Task.java:348)
           [java] 	at org.apache.tools.ant.taskdefs.MacroInstance.execute(MacroInstance.java:398)
           [java] 	at org.apache.tools.ant.UnknownElement.execute(UnknownElement.java:291)
           [java] 	at sun.reflect.GeneratedMethodAccessor30.invoke(Unknown Source)
           [java] 	at sun.reflect.DelegatingMethodAccessorImpl.invoke(DelegatingMethodAccessorImpl.java:43)
           [java] 	at java.lang.reflect.Method.invoke(Method.java:601)
           [java] 	at org.apache.tools.ant.dispatch.DispatchUtils.execute(DispatchUtils.java:106)
           [java] 	at org.apache.tools.ant.Task.perform(Task.java:348)
           [java] 	at org.apache.tools.ant.Target.execute(Target.java:390)
           [java] 	at org.apache.tools.ant.Target.performTasks(Target.java:411)
           [java] 	at org.apache.tools.ant.Project.executeSortedTargets(Project.java:1399)
           [java] 	at org.apache.tools.ant.helper.SingleCheckExecutor.executeTargets(SingleCheckExecutor.java:38)
           [java] 	at org.apache.tools.ant.Project.executeTargets(Project.java:1251)
           [java] 	at org.apache.tools.ant.taskdefs.Ant.execute(Ant.java:442)
           [java] 	at org.apache.tools.ant.UnknownElement.execute(UnknownElement.java:291)
           [java] 	at sun.reflect.GeneratedMethodAccessor30.invoke(Unknown Source)
           [java] 	at sun.reflect.DelegatingMethodAccessorImpl.invoke(DelegatingMethodAccessorImpl.java:43)
           [java] 	at java.lang.reflect.Method.invoke(Method.java:601)
           [java] 	at org.apache.tools.ant.dispatch.DispatchUtils.execute(DispatchUtils.java:106)
           [java] 	at org.apache.tools.ant.Task.perform(Task.java:348)
           [java] 	at org.apache.tools.ant.Target.execute(Target.java:390)
           [java] 	at org.apache.tools.ant.Target.performTasks(Target.java:411)
           [java] 	at org.apache.tools.ant.Project.executeSortedTargets(Project.java:1399)
           [java] 	at org.apache.tools.ant.Project.executeTarget(Project.java:1368)
           [java] 	at org.apache.maven.plugin.antrun.AntRunMojo.execute(AntRunMojo.java:327)
           [java] 	at org.apache.maven.plugin.DefaultBuildPluginManager.executeMojo(DefaultBuildPluginManager.java:106)
           [java] 	at org.apache.maven.lifecycle.internal.MojoExecutor.execute(MojoExecutor.java:208)
           [java] 	at org.apache.maven.lifecycle.internal.MojoExecutor.execute(MojoExecutor.java:153)
           [java] 	at org.apache.maven.lifecycle.internal.MojoExecutor.execute(MojoExecutor.java:145)
           [java] 	at org.apache.maven.lifecycle.internal.LifecycleModuleBuilder.buildProject(LifecycleModuleBuilder.java:84)
           [java] 	at org.apache.maven.lifecycle.internal.LifecycleModuleBuilder.buildProject(LifecycleModuleBuilder.java:59)
           [java] 	at org.apache.maven.lifecycle.internal.LifecycleStarter.singleThreadedBuild(LifecycleStarter.java:183)
           [java] 	at org.apache.maven.lifecycle.internal.LifecycleStarter.execute(LifecycleStarter.java:161)
           [java] 	at org.apache.maven.DefaultMaven.doExecute(DefaultMaven.java:317)
           [java] 	at org.apache.maven.DefaultMaven.execute(DefaultMaven.java:152)
           [java] 	at org.apache.maven.cli.MavenCli.execute(MavenCli.java:555)
           [java] 	at org.apache.maven.cli.MavenCli.doMain(MavenCli.java:214)
           [java] 	at org.apache.maven.cli.MavenCli.main(MavenCli.java:158)
           [java] 	at sun.reflect.NativeMethodAccessorImpl.invoke0(Native Method)
           [java] 	at sun.reflect.NativeMethodAccessorImpl.invoke(NativeMethodAccessorImpl.java:57)
           [java] 	at sun.reflect.DelegatingMethodAccessorImpl.invoke(DelegatingMethodAccessorImpl.java:43)
           [java] 	at java.lang.reflect.Method.invoke(Method.java:601)
           [java] 	at org.codehaus.plexus.classworlds.launcher.Launcher.launchEnhanced(Launcher.java:289)
           [java] 	at org.codehaus.plexus.classworlds.launcher.Launcher.launch(Launcher.java:229)
           [java] 	at org.codehaus.plexus.classworlds.launcher.Launcher.mainWithExitCode(Launcher.java:415)
           [java] 	at org.codehaus.plexus.classworlds.launcher.Launcher.main(Launcher.java:356)
           [java] Caused by: java.lang.IllegalStateException: Could not find '[subsystem=../../../../../../jboss-as/build/src/main/resources/configuration/subsystems/threads.xml, supplement=null]' under the base directory '/home/hudson/workspace/narayana-codeCoverage/blacktie/wildfly-blacktie/build/src/main/resources'
           [java] 	at org.jboss.as.config.assembly.ConfigurationAssembler.populateTemplate(ConfigurationAssembler.java:109)
           [java] 	at org.jboss.as.config.assembly.ConfigurationAssembler.assemble(ConfigurationAssembler.java:64)
           [java] 	at org.jboss.as.config.assembly.StandaloneMain.main(StandaloneMain.java:53)
           [java] 	at sun.reflect.NativeMethodAccessorImpl.invoke0(Native Method)
           [java] 	at sun.reflect.NativeMethodAccessorImpl.invoke(NativeMethodAccessorImpl.java:57)
           [java] 	at sun.reflect.DelegatingMethodAccessorImpl.invoke(DelegatingMethodAccessorImpl.java:43)
           [java] 	at java.lang.reflect.Method.invoke(Method.java:601)
           [java] 	at org.apache.tools.ant.taskdefs.ExecuteJava.run(ExecuteJava.java:217)
           [java] 	at org.apache.tools.ant.taskdefs.ExecuteJava.execute(ExecuteJava.java:152)
           [java] 	... 76 more
           [java] Java Result: -1
      
      all:
      [INFO] Executed tasks
      [INFO] 
      [INFO] --- byteman-rulecheck-maven-plugin:2.1.3:rulecheck (rulecheck) @ wildfly-blacktie-build ---
      [INFO] 
      [INFO] --- jacoco-maven-plugin:0.6.3.201306030806:report (post-unit-test) @ wildfly-blacktie-build ---
      [INFO] Skipping JaCoCo for project with packaging type 'pom'
      [INFO] 
      [INFO] --- jacoco-maven-plugin:0.6.3.201306030806:check (check) @ wildfly-blacktie-build ---
      [INFO] Skipping JaCoCo for project with packaging type 'pom'
      [INFO] 
      [INFO] >>> maven-source-plugin:2.2.1:jar (attach-sources) @ wildfly-blacktie-build >>>
      [INFO] 
      [INFO] --- maven-enforcer-plugin:1.3.1:enforce (enforce-java-version) @ wildfly-blacktie-build ---
      [INFO] 
      [INFO] --- maven-enforcer-plugin:1.3.1:enforce (enforce-maven-version) @ wildfly-blacktie-build ---
      [INFO] 
      [INFO] --- buildnumber-maven-plugin:1.2:create-timestamp (get-build-timestamp) @ wildfly-blacktie-build ---
      [INFO] 
      [INFO] --- buildnumber-maven-plugin:1.2:create (get-scm-revision) @ wildfly-blacktie-build ---
      [INFO] 
      [INFO] --- jacoco-maven-plugin:0.6.3.201306030806:prepare-agent (pre-unit-test) @ wildfly-blacktie-build ---
      [INFO] Skipping JaCoCo for project with packaging type 'pom'
      [INFO] surefireArgLine set to  
      [INFO] 
      [INFO] <<< maven-source-plugin:2.2.1:jar (attach-sources) @ wildfly-blacktie-build <<<
      [INFO] 
      [INFO] --- maven-source-plugin:2.2.1:jar (attach-sources) @ wildfly-blacktie-build ---
      [INFO] 
      [INFO] --- maven-source-plugin:2.2.1:jar-no-fork (attach-sources) @ wildfly-blacktie-build ---
      [INFO] 
      [INFO] --- maven-assembly-plugin:2.4:single (make-assembly) @ wildfly-blacktie-build ---
      [INFO] Reading assembly descriptor: src/main/assembly/zip.xml
      [INFO] Building zip: /home/hudson/workspace/narayana-codeCoverage/blacktie/wildfly-blacktie/build/target/wildfly-blacktie-build-5.0.2.Final-SNAPSHOT-bin.zip
      [INFO] 
      [INFO] --- maven-install-plugin:2.4:install (default-install) @ wildfly-blacktie-build ---
      [INFO] Installing /home/hudson/workspace/narayana-codeCoverage/blacktie/wildfly-blacktie/build/pom.xml to /home/hudson/.m2/repository/org/jboss/narayana/blacktie/wildfly-blacktie-build/5.0.2.Final-SNAPSHOT/wildfly-blacktie-build-5.0.2.Final-SNAPSHOT.pom
      [INFO] Installing /home/hudson/workspace/narayana-codeCoverage/blacktie/wildfly-blacktie/build/target/wildfly-blacktie-build-5.0.2.Final-SNAPSHOT-bin.zip to /home/hudson/.m2/repository/org/jboss/narayana/blacktie/wildfly-blacktie-build/5.0.2.Final-SNAPSHOT/wildfly-blacktie-build-5.0.2.Final-SNAPSHOT-bin.zip
      [INFO] ------------------------------------------------------------------------
      [INFO] Reactor Summary:
      [INFO] 
      [INFO] WildFly: Blacktie Subsystem Parent ................ SUCCESS [2.417s]
      [INFO] WildFly: Blacktie Subsystem ....................... SUCCESS [8.332s]
      [INFO] WildFly: Blacktie Subsystem Build ................. SUCCESS [1.941s]
      [INFO] ------------------------------------------------------------------------
      [INFO] BUILD SUCCESS
      [INFO] ------------------------------------------------------------------------
      [INFO] Total time: 13.141s
      [INFO] Finished at: Fri Apr 04 23:23:50 BST 2014
      [INFO] Final Memory: 56M/253M
      [INFO] ------------------------------------------------------------------------
      Archive:  /home/hudson/workspace/narayana-codeCoverage/blacktie/wildfly-blacktie/build/target/wildfly-blacktie-build-5.0.2.Final-SNAPSHOT-bin.zip
         creating: /home/hudson/workspace/narayana-codeCoverage/blacktie/wildfly-8.0.1.Final-SNAPSHOT/modules/system/layers/base/org/wildfly/extension/blacktie/
         creating: /home/hudson/workspace/narayana-codeCoverage/blacktie/wildfly-8.0.1.Final-SNAPSHOT/modules/system/layers/base/org/wildfly/extension/blacktie/main/
       extracting: /home/hudson/workspace/narayana-codeCoverage/blacktie/wildfly-8.0.1.Final-SNAPSHOT/modules/system/layers/base/org/wildfly/extension/blacktie/main/wildfly-blacktie-5.0.2.Final-SNAPSHOT.jar  
        inflating: /home/hudson/workspace/narayana-codeCoverage/blacktie/wildfly-8.0.1.Final-SNAPSHOT/modules/system/layers/base/org/wildfly/extension/blacktie/main/module.xml  
      Buildfile: /home/hudson/workspace/narayana-codeCoverage/blacktie/scripts/hudson/initializeJBoss.xml
      
      initializeJBoss:
      
      BUILD FAILED
      /home/hudson/workspace/narayana-codeCoverage/blacktie/scripts/hudson/initializeJBoss.xml:5: Warning: Could not find file /home/hudson/workspace/narayana-codeCoverage/blacktie/wildfly-8.0.1.Final-SNAPSHOT/docs/examples/configs/standalone-blacktie.xml to copy.
      

        Gliffy Diagrams

          Attachments

            Issue Links

              Activity

                People

                • Assignee:
                  zhfeng Zheng Feng
                  Reporter:
                  gytis Gytis Trikleris
                • Votes:
                  0 Vote for this issue
                  Watchers:
                  1 Start watching this issue

                  Dates

                  • Created:
                    Updated:
                    Resolved: