Uploaded image for project: 'JBoss Transaction Manager'
  1. JBoss Transaction Manager
  2. JBTM-1830

WSBAParticipantCompletionTestCase failure: 'participant_completion_coordinator_rules.btm' either doesn't exist or isn't a file

    Details

      Description

      http://172.17.131.2/view/Narayana+BlackTie/job/narayana/173/TESTS=XTS,jdk=jdk7.latest,label=linux/consoleText

      -------------------------------------------------------------------------------
      Test set: org.jboss.as.test.xts.simple.wsba.participantcompletion.client.WSBAParticipantCompletionTestCase
      -------------------------------------------------------------------------------
      Tests run: 2, Failures: 0, Errors: 2, Skipped: 0, Time elapsed: 0.704 sec <<< FAILURE!
      org.jboss.as.test.xts.simple.wsba.participantcompletion.client.WSBAParticipantCompletionTestCase  Time elapsed: 2.325 sec  <<< ERROR!
      java.lang.RuntimeException: Failed to submit Byteman script
      	at org.jboss.as.test.xts.simple.BMScript.submit(BMScript.java:43)
      	at org.jboss.as.test.xts.simple.wsba.participantcompletion.client.WSBAParticipantCompletionTestCase.submitBytemanScript(WSBAParticipantCompletionTestCase.java:69)
      	at sun.reflect.NativeMethodAccessorImpl.invoke0(Native Method)
      	at sun.reflect.NativeMethodAccessorImpl.invoke(NativeMethodAccessorImpl.java:57)
      	at sun.reflect.DelegatingMethodAccessorImpl.invoke(DelegatingMethodAccessorImpl.java:43)
      	at java.lang.reflect.Method.invoke(Method.java:601)
      	at org.junit.runners.model.FrameworkMethod$1.runReflectiveCall(FrameworkMethod.java:47)
      	at org.junit.internal.runners.model.ReflectiveCallable.run(ReflectiveCallable.java:12)
      	at org.junit.runners.model.FrameworkMethod.invokeExplosively(FrameworkMethod.java:44)
      	at org.junit.internal.runners.statements.RunBefores.evaluate(RunBefores.java:24)
      	at org.jboss.arquillian.junit.Arquillian$StatementLifecycleExecutor.invoke(Arquillian.java:351)
      	at org.jboss.arquillian.container.test.impl.execution.ClientBeforeAfterLifecycleEventExecuter.execute(ClientBeforeAfterLifecycleEventExecuter.java:99)
      	at org.jboss.arquillian.container.test.impl.execution.ClientBeforeAfterLifecycleEventExecuter.on(ClientBeforeAfterLifecycleEventExecuter.java:60)
      	at sun.reflect.NativeMethodAccessorImpl.invoke0(Native Method)
      	at sun.reflect.NativeMethodAccessorImpl.invoke(NativeMethodAccessorImpl.java:57)
      	at sun.reflect.DelegatingMethodAccessorImpl.invoke(DelegatingMethodAccessorImpl.java:43)
      	at java.lang.reflect.Method.invoke(Method.java:601)
      	at org.jboss.arquillian.core.impl.ObserverImpl.invoke(ObserverImpl.java:94)
      	at org.jboss.arquillian.core.impl.EventContextImpl.invokeObservers(EventContextImpl.java:99)
      	at org.jboss.arquillian.core.impl.EventContextImpl.proceed(EventContextImpl.java:81)
      	at org.jboss.arquillian.test.impl.TestContextHandler.createClassContext(TestContextHandler.java:75)
      	at sun.reflect.NativeMethodAccessorImpl.invoke0(Native Method)
      	at sun.reflect.NativeMethodAccessorImpl.invoke(NativeMethodAccessorImpl.java:57)
      	at sun.reflect.DelegatingMethodAccessorImpl.invoke(DelegatingMethodAccessorImpl.java:43)
      	at java.lang.reflect.Method.invoke(Method.java:601)
      	at org.jboss.arquillian.core.impl.ObserverImpl.invoke(ObserverImpl.java:94)
      	at org.jboss.arquillian.core.impl.EventContextImpl.proceed(EventContextImpl.java:88)
      	at org.jboss.arquillian.test.impl.TestContextHandler.createSuiteContext(TestContextHandler.java:60)
      	at sun.reflect.NativeMethodAccessorImpl.invoke0(Native Method)
      	at sun.reflect.NativeMethodAccessorImpl.invoke(NativeMethodAccessorImpl.java:57)
      	at sun.reflect.DelegatingMethodAccessorImpl.invoke(DelegatingMethodAccessorImpl.java:43)
      	at java.lang.reflect.Method.invoke(Method.java:601)
      	at org.jboss.arquillian.core.impl.ObserverImpl.invoke(ObserverImpl.java:94)
      	at org.jboss.arquillian.core.impl.EventContextImpl.proceed(EventContextImpl.java:88)
      	at org.jboss.arquillian.core.impl.ManagerImpl.fire(ManagerImpl.java:135)
      	at org.jboss.arquillian.core.impl.ManagerImpl.fire(ManagerImpl.java:115)
      	at org.jboss.arquillian.test.impl.EventTestRunnerAdaptor.beforeClass(EventTestRunnerAdaptor.java:80)
      	at org.jboss.arquillian.junit.Arquillian$2.evaluate(Arquillian.java:182)
      	at org.jboss.arquillian.junit.Arquillian.multiExecute(Arquillian.java:314)
      	at org.jboss.arquillian.junit.Arquillian.access$100(Arquillian.java:46)
      	at org.jboss.arquillian.junit.Arquillian$3.evaluate(Arquillian.java:199)
      	at org.junit.runners.ParentRunner.run(ParentRunner.java:309)
      	at org.jboss.arquillian.junit.Arquillian.run(Arquillian.java:147)
      	at org.apache.maven.surefire.junit4.JUnit4Provider.execute(JUnit4Provider.java:234)
      	at org.apache.maven.surefire.junit4.JUnit4Provider.executeTestSet(JUnit4Provider.java:133)
      	at org.apache.maven.surefire.junit4.JUnit4Provider.invoke(JUnit4Provider.java:114)
      	at sun.reflect.NativeMethodAccessorImpl.invoke0(Native Method)
      	at sun.reflect.NativeMethodAccessorImpl.invoke(NativeMethodAccessorImpl.java:57)
      	at sun.reflect.DelegatingMethodAccessorImpl.invoke(DelegatingMethodAccessorImpl.java:43)
      	at java.lang.reflect.Method.invoke(Method.java:601)
      	at org.apache.maven.surefire.util.ReflectionUtils.invokeMethodWithArray(ReflectionUtils.java:188)
      	at org.apache.maven.surefire.booter.ProviderFactory$ProviderProxy.invoke(ProviderFactory.java:166)
      	at org.apache.maven.surefire.booter.ProviderFactory.invokeProvider(ProviderFactory.java:86)
      	at org.apache.maven.surefire.booter.ForkedBooter.runSuitesInProcess(ForkedBooter.java:101)
      	at org.apache.maven.surefire.booter.ForkedBooter.main(ForkedBooter.java:74)
      Caused by: java.lang.RuntimeException: 'participant_completion_coordinator_rules.btm' either doesn't exist or isn't a file
      	at org.jboss.as.test.xts.simple.BMScript.getScriptFiles(BMScript.java:69)
      	at org.jboss.as.test.xts.simple.BMScript.submit(BMScript.java:40)
      	... 54 more
      org.jboss.as.test.xts.simple.wsba.participantcompletion.client.WSBAParticipantCompletionTestCase  Time elapsed: 2.326 sec  <<< ERROR!
      java.lang.RuntimeException: Failed to remove Byteman script
      	at org.jboss.as.test.xts.simple.BMScript.remove(BMScript.java:53)
      	at org.jboss.as.test.xts.simple.wsba.participantcompletion.client.WSBAParticipantCompletionTestCase.removeBytemanScript(WSBAParticipantCompletionTestCase.java:74)
      	at sun.reflect.NativeMethodAccessorImpl.invoke0(Native Method)
      	at sun.reflect.NativeMethodAccessorImpl.invoke(NativeMethodAccessorImpl.java:57)
      	at sun.reflect.DelegatingMethodAccessorImpl.invoke(DelegatingMethodAccessorImpl.java:43)
      	at java.lang.reflect.Method.invoke(Method.java:601)
      	at org.junit.runners.model.FrameworkMethod$1.runReflectiveCall(FrameworkMethod.java:47)
      	at org.junit.internal.runners.model.ReflectiveCallable.run(ReflectiveCallable.java:12)
      	at org.junit.runners.model.FrameworkMethod.invokeExplosively(FrameworkMethod.java:44)
      	at org.junit.internal.runners.statements.RunAfters.evaluate(RunAfters.java:33)
      	at org.jboss.arquillian.junit.Arquillian$StatementLifecycleExecutor.invoke(Arquillian.java:351)
      	at org.jboss.arquillian.container.test.impl.execution.ClientBeforeAfterLifecycleEventExecuter.execute(ClientBeforeAfterLifecycleEventExecuter.java:99)
      	at org.jboss.arquillian.container.test.impl.execution.ClientBeforeAfterLifecycleEventExecuter.on(ClientBeforeAfterLifecycleEventExecuter.java:65)
      	at sun.reflect.NativeMethodAccessorImpl.invoke0(Native Method)
      	at sun.reflect.NativeMethodAccessorImpl.invoke(NativeMethodAccessorImpl.java:57)
      	at sun.reflect.DelegatingMethodAccessorImpl.invoke(DelegatingMethodAccessorImpl.java:43)
      	at java.lang.reflect.Method.invoke(Method.java:601)
      	at org.jboss.arquillian.core.impl.ObserverImpl.invoke(ObserverImpl.java:94)
      	at org.jboss.arquillian.core.impl.EventContextImpl.invokeObservers(EventContextImpl.java:99)
      	at org.jboss.arquillian.core.impl.EventContextImpl.proceed(EventContextImpl.java:81)
      	at org.jboss.arquillian.test.impl.TestContextHandler.createClassContext(TestContextHandler.java:75)
      	at sun.reflect.NativeMethodAccessorImpl.invoke0(Native Method)
      	at sun.reflect.NativeMethodAccessorImpl.invoke(NativeMethodAccessorImpl.java:57)
      	at sun.reflect.DelegatingMethodAccessorImpl.invoke(DelegatingMethodAccessorImpl.java:43)
      	at java.lang.reflect.Method.invoke(Method.java:601)
      	at org.jboss.arquillian.core.impl.ObserverImpl.invoke(ObserverImpl.java:94)
      	at org.jboss.arquillian.core.impl.EventContextImpl.proceed(EventContextImpl.java:88)
      	at org.jboss.arquillian.test.impl.TestContextHandler.createSuiteContext(TestContextHandler.java:60)
      	at sun.reflect.NativeMethodAccessorImpl.invoke0(Native Method)
      	at sun.reflect.NativeMethodAccessorImpl.invoke(NativeMethodAccessorImpl.java:57)
      	at sun.reflect.DelegatingMethodAccessorImpl.invoke(DelegatingMethodAccessorImpl.java:43)
      	at java.lang.reflect.Method.invoke(Method.java:601)
      	at org.jboss.arquillian.core.impl.ObserverImpl.invoke(ObserverImpl.java:94)
      	at org.jboss.arquillian.core.impl.EventContextImpl.proceed(EventContextImpl.java:88)
      	at org.jboss.arquillian.core.impl.ManagerImpl.fire(ManagerImpl.java:135)
      	at org.jboss.arquillian.core.impl.ManagerImpl.fire(ManagerImpl.java:115)
      	at org.jboss.arquillian.test.impl.EventTestRunnerAdaptor.afterClass(EventTestRunnerAdaptor.java:87)
      	at org.jboss.arquillian.junit.Arquillian$3$1.evaluate(Arquillian.java:204)
      	at org.jboss.arquillian.junit.Arquillian.multiExecute(Arquillian.java:314)
      	at org.jboss.arquillian.junit.Arquillian.access$100(Arquillian.java:46)
      	at org.jboss.arquillian.junit.Arquillian$3.evaluate(Arquillian.java:199)
      	at org.junit.runners.ParentRunner.run(ParentRunner.java:309)
      	at org.jboss.arquillian.junit.Arquillian.run(Arquillian.java:147)
      	at org.apache.maven.surefire.junit4.JUnit4Provider.execute(JUnit4Provider.java:234)
      	at org.apache.maven.surefire.junit4.JUnit4Provider.executeTestSet(JUnit4Provider.java:133)
      	at org.apache.maven.surefire.junit4.JUnit4Provider.invoke(JUnit4Provider.java:114)
      	at sun.reflect.NativeMethodAccessorImpl.invoke0(Native Method)
      	at sun.reflect.NativeMethodAccessorImpl.invoke(NativeMethodAccessorImpl.java:57)
      	at sun.reflect.DelegatingMethodAccessorImpl.invoke(DelegatingMethodAccessorImpl.java:43)
      	at java.lang.reflect.Method.invoke(Method.java:601)
      	at org.apache.maven.surefire.util.ReflectionUtils.invokeMethodWithArray(ReflectionUtils.java:188)
      	at org.apache.maven.surefire.booter.ProviderFactory$ProviderProxy.invoke(ProviderFactory.java:166)
      	at org.apache.maven.surefire.booter.ProviderFactory.invokeProvider(ProviderFactory.java:86)
      	at org.apache.maven.surefire.booter.ForkedBooter.runSuitesInProcess(ForkedBooter.java:101)
      	at org.apache.maven.surefire.booter.ForkedBooter.main(ForkedBooter.java:74)
      Caused by: java.lang.RuntimeException: 'participant_completion_coordinator_rules.btm' either doesn't exist or isn't a file
      	at org.jboss.as.test.xts.simple.BMScript.getScriptFiles(BMScript.java:69)
      	at org.jboss.as.test.xts.simple.BMScript.remove(BMScript.java:50)
      	... 54 more
      

        Gliffy Diagrams

          Attachments

            Activity

              People

              • Assignee:
                zhfeng Zheng Feng
                Reporter:
                gytis Gytis Trikleris
              • Votes:
                0 Vote for this issue
                Watchers:
                3 Start watching this issue

                Dates

                • Created:
                  Updated:
                  Resolved: