Uploaded image for project: 'JBoss Transaction Manager'
  1. JBoss Transaction Manager
  2. JBTM-1798

Blacktie C++ XATMI Implementation bulid failed

    XMLWordPrintable

    Details

      Description

      http://172.17.131.2/view/Narayana+BlackTie/job/narayana-codeCoverage/28/consoleText

      [ERROR] Failed to execute goal org.jboss.narayana.blacktie.plugins:blacktie-cpp-plugin:5.0.0.M4-SNAPSHOT:test (test) on project blacktie-xatmi: Failed to execute: Executing Ant script: /btcpp.build.xml [test]: Failed to execute. The following error occurred while executing this line:
      [ERROR] /tmp/plexus-ant-component8015094996193894451.build.xml:586: exec returned: 1
      [ERROR] -> [Help 1]
      [ERROR] 
      [ERROR] To see the full stack trace of the errors, re-run Maven with the -e switch.
      [ERROR] Re-run Maven using the -X switch to enable full debug logging.
      [ERROR] 
      [ERROR] For more information about the errors and possible solutions, please read the following articles:
      [ERROR] [Help 1] http://cwiki.apache.org/confluence/display/MAVEN/MojoExecutionException
      [ERROR] 
      [ERROR] After correcting the problems, you can resume the build with the command
      [ERROR]   mvn <goals> -rf :blacktie-xatmi
      UID        PID  PPID  C STIME TTY          TIME CMD
      hudson    8865 26268  0 00:46 ?        00:00:00 /bin/bash -xe /tmp/hudson5641153487326180338.sh
      hudson    8901  8865  0 00:46 ?        00:00:00 /bin/sh /home/hudson/workspace/narayana-codeCoverage/blacktie/jboss-as//bin/standalone.sh -c standalone-full.xml -Djboss.bind.address=localhost -Djboss.bind.address.unsecure=localhost
      hudson    8962  8901  1 00:46 ?        00:00:55 /usr/local/jdk1.7.0_17/bin/java -D[Standalone] -server -XX:+UseCompressedOops -Xmx256m -XX:MaxPermSize=256m -DOrbPortabilityEnvironmentBean.resolveService=NAME_SERVICE -Dorg.jboss.boot.log.file=/home/hudson/workspace/narayana-codeCoverage/blacktie/jboss-as//standalone/log/server.log -Dlogging.configuration=file:/home/hudson/workspace/narayana-codeCoverage/blacktie/jboss-as//standalone/configuration/logging.properties -jar /home/hudson/workspace/narayana-codeCoverage/blacktie/jboss-as//jboss-modules.jar -mp /home/hudson/workspace/narayana-codeCoverage/blacktie/jboss-as//modules org.jboss.as.standalone -Djboss.home.dir=/home/hudson/workspace/narayana-codeCoverage/blacktie/jboss-as/ -Djboss.server.base.dir=/home/hudson/workspace/narayana-codeCoverage/blacktie/jboss-as//standalone -c standalone-full.xml -Djboss.bind.address=localhost -Djboss.bind.address.unsecure=localhost
      hudson   15400  8865  0 01:35 ?        00:00:00 ps -f
      hudson   21645 21639  0 Apr26 ?        00:50:08 sshd: hudson@notty
      hudson   22013 21645  0 Apr26 ?        00:00:00 bash -c cd '/home/hudson' && java  -jar slave.jar
      hudson   22102 22013  0 Apr26 ?        01:30:33 java -jar slave.jar
      hudson   26161 22102  0 00:22 ?        00:00:00 /bin/bash -xe /tmp/hudson5641153487326180338.sh
      hudson   26268 26161  0 00:22 ?        00:00:00 /bin/bash -xe /tmp/hudson5641153487326180338.sh
      testsuite: no process killed
      server: no process killed
      client: no process killed
      cs: no process killed
      UID        PID  PPID  C STIME TTY          TIME CMD
      hudson    8865 26268  0 00:46 ?        00:00:00 /bin/bash -xe /tmp/hudson5641153487326180338.sh
      hudson    8901  8865  0 00:46 ?        00:00:00 /bin/sh /home/hudson/workspace/narayana-codeCoverage/blacktie/jboss-as//bin/standalone.sh -c standalone-full.xml -Djboss.bind.address=localhost -Djboss.bind.address.unsecure=localhost
      hudson    8962  8901  1 00:46 ?        00:00:55 [java] <defunct>
      hudson   15411  8865  0 01:35 ?        00:00:00 ps -f
      hudson   21645 21639  0 Apr26 ?        00:50:08 sshd: hudson@notty
      hudson   22013 21645  0 Apr26 ?        00:00:00 bash -c cd '/home/hudson' && java  -jar slave.jar
      hudson   22102 22013  0 Apr26 ?        01:30:33 java -jar slave.jar
      hudson   26161 22102  0 00:22 ?        00:00:00 /bin/bash -xe /tmp/hudson5641153487326180338.sh
      hudson   26268 26161  0 00:22 ?        00:00:00 /bin/bash -xe /tmp/hudson5641153487326180338.sh
      Some tests failed: http://172.17.131.2/job/narayana-codeCoverage/28/
      BlackTie build failed
      Build step 'Execute shell' marked build as failure
      Archiving artifacts
      Sending e-mails to: gtrikler@redhat.com
      Finished: FAILURE
      

        Gliffy Diagrams

          Attachments

            Activity

              People

              • Assignee:
                tomjenkinson Thomas Jenkinson
                Reporter:
                gytis Gytis Trikleris
              • Votes:
                0 Vote for this issue
                Watchers:
                3 Start watching this issue

                Dates

                • Created:
                  Updated:
                  Resolved: