Uploaded image for project: 'JBoss Transaction Manager'
  1. JBoss Transaction Manager
  2. JBTM-1757

Tests fail when building with emma

    XMLWordPrintable

    Details

    • Type: Bug
    • Status: Closed (View Workflow)
    • Priority: Major
    • Resolution: Done
    • Affects Version/s: 5.0.0.M3
    • Fix Version/s: 5.0.0.M4
    • Component/s: Build System, Testing
    • Labels:
      None
    • Environment:

      Mac OS 10.7.5
      JDK 7

      Description

      The following tests fail or hang when building with emma (command used is ./build.sh clean install -PcodeCoverage emma:emma):

      test(com.hp.mwtests.ts.arjuna.atomicaction.CheckedActionTest) Time elapsed: 0.005 sec <<< FAILURE!
      java.lang.AssertionError
      at org.junit.Assert.fail(Assert.java:92)
      at org.junit.Assert.assertTrue(Assert.java:43)
      at org.junit.Assert.assertTrue(Assert.java:54)
      at com.hp.mwtests.ts.arjuna.atomicaction.CheckedActionTest.test(CheckedActionTest.java:49)
      at sun.reflect.NativeMethodAccessorImpl.invoke0(Native Method)
      at sun.reflect.NativeMethodAccessorImpl.invoke(NativeMethodAccessorImpl.java:57)
      at sun.reflect.DelegatingMethodAccessorImpl.invoke(DelegatingMethodAccessorImpl.java:43)
      at java.lang.reflect.Method.invoke(Method.java:601)
      at org.junit.runners.model.FrameworkMethod$1.runReflectiveCall(FrameworkMethod.java:45)
      at org.junit.internal.runners.model.ReflectiveCallable.run(ReflectiveCallable.java:15)
      at org.junit.runners.model.FrameworkMethod.invokeExplosively(FrameworkMethod.java:42)
      at org.junit.internal.runners.statements.InvokeMethod.evaluate(InvokeMethod.java:20)
      at org.junit.runners.ParentRunner.runLeaf(ParentRunner.java:263)
      at org.junit.runners.BlockJUnit4ClassRunner.runChild(BlockJUnit4ClassRunner.java:68)
      at org.junit.runners.BlockJUnit4ClassRunner.runChild(BlockJUnit4ClassRunner.java:47)
      at org.junit.runners.ParentRunner$3.run(ParentRunner.java:231)
      at org.junit.runners.ParentRunner$1.schedule(ParentRunner.java:60)
      at org.junit.runners.ParentRunner.runChildren(ParentRunner.java:229)
      at org.junit.runners.ParentRunner.access$000(ParentRunner.java:50)
      at org.junit.runners.ParentRunner$2.evaluate(ParentRunner.java:222)
      at org.junit.runners.ParentRunner.run(ParentRunner.java:300)
      at org.apache.maven.surefire.junit4.JUnit4Provider.execute(JUnit4Provider.java:252)
      at org.apache.maven.surefire.junit4.JUnit4Provider.executeTestSet(JUnit4Provider.java:141)
      at org.apache.maven.surefire.junit4.JUnit4Provider.invoke(JUnit4Provider.java:112)
      at sun.reflect.NativeMethodAccessorImpl.invoke0(Native Method)
      at sun.reflect.NativeMethodAccessorImpl.invoke(NativeMethodAccessorImpl.java:57)
      at sun.reflect.DelegatingMethodAccessorImpl.invoke(DelegatingMethodAccessorImpl.java:43)
      at java.lang.reflect.Method.invoke(Method.java:601)
      at org.apache.maven.surefire.util.ReflectionUtils.invokeMethodWithArray(ReflectionUtils.java:189)
      at org.apache.maven.surefire.booter.ProviderFactory$ProviderProxy.invoke(ProviderFactory.java:165)
      at org.apache.maven.surefire.booter.ProviderFactory.invokeProvider(ProviderFactory.java:85)
      at org.apache.maven.surefire.booter.ForkedBooter.runSuitesInProcess(ForkedBooter.java:115)
      at org.apache.maven.surefire.booter.ForkedBooter.main(ForkedBooter.java:75)

      testCheckedAction(com.hp.mwtests.ts.arjuna.atomicaction.CheckedActionTest) Time elapsed: 0.001 sec <<< FAILURE!
      java.lang.AssertionError
      at org.junit.Assert.fail(Assert.java:92)
      at org.junit.Assert.assertTrue(Assert.java:43)
      at org.junit.Assert.assertTrue(Assert.java:54)
      at com.hp.mwtests.ts.arjuna.atomicaction.CheckedActionTest.testCheckedAction(CheckedActionTest.java:74)
      at sun.reflect.NativeMethodAccessorImpl.invoke0(Native Method)
      at sun.reflect.NativeMethodAccessorImpl.invoke(NativeMethodAccessorImpl.java:57)
      at sun.reflect.DelegatingMethodAccessorImpl.invoke(DelegatingMethodAccessorImpl.java:43)
      at java.lang.reflect.Method.invoke(Method.java:601)
      at org.junit.runners.model.FrameworkMethod$1.runReflectiveCall(FrameworkMethod.java:45)
      at org.junit.internal.runners.model.ReflectiveCallable.run(ReflectiveCallable.java:15)
      at org.junit.runners.model.FrameworkMethod.invokeExplosively(FrameworkMethod.java:42)
      at org.junit.internal.runners.statements.InvokeMethod.evaluate(InvokeMethod.java:20)
      at org.junit.runners.ParentRunner.runLeaf(ParentRunner.java:263)
      at org.junit.runners.BlockJUnit4ClassRunner.runChild(BlockJUnit4ClassRunner.java:68)
      at org.junit.runners.BlockJUnit4ClassRunner.runChild(BlockJUnit4ClassRunner.java:47)
      at org.junit.runners.ParentRunner$3.run(ParentRunner.java:231)
      at org.junit.runners.ParentRunner$1.schedule(ParentRunner.java:60)
      at org.junit.runners.ParentRunner.runChildren(ParentRunner.java:229)
      at org.junit.runners.ParentRunner.access$000(ParentRunner.java:50)
      at org.junit.runners.ParentRunner$2.evaluate(ParentRunner.java:222)
      at org.junit.runners.ParentRunner.run(ParentRunner.java:300)
      at org.apache.maven.surefire.junit4.JUnit4Provider.execute(JUnit4Provider.java:252)
      at org.apache.maven.surefire.junit4.JUnit4Provider.executeTestSet(JUnit4Provider.java:141)
      at org.apache.maven.surefire.junit4.JUnit4Provider.invoke(JUnit4Provider.java:112)
      at sun.reflect.NativeMethodAccessorImpl.invoke0(Native Method)
      at sun.reflect.NativeMethodAccessorImpl.invoke(NativeMethodAccessorImpl.java:57)
      at sun.reflect.DelegatingMethodAccessorImpl.invoke(DelegatingMethodAccessorImpl.java:43)
      at java.lang.reflect.Method.invoke(Method.java:601)
      at org.apache.maven.surefire.util.ReflectionUtils.invokeMethodWithArray(ReflectionUtils.java:189)
      at org.apache.maven.surefire.booter.ProviderFactory$ProviderProxy.invoke(ProviderFactory.java:165)
      at org.apache.maven.surefire.booter.ProviderFactory.invokeProvider(ProviderFactory.java:85)
      at org.apache.maven.surefire.booter.ForkedBooter.runSuitesInProcess(ForkedBooter.java:115)
      at org.apache.maven.surefire.booter.ForkedBooter.main(ForkedBooter.java:75)

      testGetSet(com.hp.mwtests.ts.arjuna.atomicaction.TxControlUnitTest) Time elapsed: 0.001 sec <<< FAILURE!
      java.lang.AssertionError: expected:<false> but was:<true>
      at org.junit.Assert.fail(Assert.java:93)
      at org.junit.Assert.failNotEquals(Assert.java:647)
      at org.junit.Assert.assertEquals(Assert.java:128)
      at org.junit.Assert.assertEquals(Assert.java:147)
      at com.hp.mwtests.ts.arjuna.atomicaction.TxControlUnitTest.testGetSet(TxControlUnitTest.java:64)
      at sun.reflect.NativeMethodAccessorImpl.invoke0(Native Method)
      at sun.reflect.NativeMethodAccessorImpl.invoke(NativeMethodAccessorImpl.java:57)
      at sun.reflect.DelegatingMethodAccessorImpl.invoke(DelegatingMethodAccessorImpl.java:43)
      at java.lang.reflect.Method.invoke(Method.java:601)
      at org.junit.runners.model.FrameworkMethod$1.runReflectiveCall(FrameworkMethod.java:45)
      at org.junit.internal.runners.model.ReflectiveCallable.run(ReflectiveCallable.java:15)
      at org.junit.runners.model.FrameworkMethod.invokeExplosively(FrameworkMethod.java:42)
      at org.junit.internal.runners.statements.InvokeMethod.evaluate(InvokeMethod.java:20)
      at org.junit.runners.ParentRunner.runLeaf(ParentRunner.java:263)
      at org.junit.runners.BlockJUnit4ClassRunner.runChild(BlockJUnit4ClassRunner.java:68)
      at org.junit.runners.BlockJUnit4ClassRunner.runChild(BlockJUnit4ClassRunner.java:47)
      at org.junit.runners.ParentRunner$3.run(ParentRunner.java:231)
      at org.junit.runners.ParentRunner$1.schedule(ParentRunner.java:60)
      at org.junit.runners.ParentRunner.runChildren(ParentRunner.java:229)
      at org.junit.runners.ParentRunner.access$000(ParentRunner.java:50)
      at org.junit.runners.ParentRunner$2.evaluate(ParentRunner.java:222)
      at org.junit.runners.ParentRunner.run(ParentRunner.java:300)
      at org.apache.maven.surefire.junit4.JUnit4Provider.execute(JUnit4Provider.java:252)
      at org.apache.maven.surefire.junit4.JUnit4Provider.executeTestSet(JUnit4Provider.java:141)
      at org.apache.maven.surefire.junit4.JUnit4Provider.invoke(JUnit4Provider.java:112)
      at sun.reflect.NativeMethodAccessorImpl.invoke0(Native Method)
      at sun.reflect.NativeMethodAccessorImpl.invoke(NativeMethodAccessorImpl.java:57)
      at sun.reflect.DelegatingMethodAccessorImpl.invoke(DelegatingMethodAccessorImpl.java:43)
      at java.lang.reflect.Method.invoke(Method.java:601)
      at org.apache.maven.surefire.util.ReflectionUtils.invokeMethodWithArray(ReflectionUtils.java:189)
      at org.apache.maven.surefire.booter.ProviderFactory$ProviderProxy.invoke(ProviderFactory.java:165)
      at org.apache.maven.surefire.booter.ProviderFactory.invokeProvider(ProviderFactory.java:85)
      at org.apache.maven.surefire.booter.ForkedBooter.runSuitesInProcess(ForkedBooter.java:115)
      at org.apache.maven.surefire.booter.ForkedBooter.main(ForkedBooter.java:75)

      test(com.hp.mwtests.ts.arjuna.objectstore.AltStoreTest) Time elapsed: 0.119 sec <<< FAILURE!
      java.lang.AssertionError
      at org.junit.Assert.fail(Assert.java:92)
      at org.junit.Assert.assertTrue(Assert.java:43)
      at org.junit.Assert.assertFalse(Assert.java:68)
      at org.junit.Assert.assertFalse(Assert.java:79)
      at com.hp.mwtests.ts.arjuna.objectstore.AltStoreTest.test(AltStoreTest.java:72)
      at sun.reflect.NativeMethodAccessorImpl.invoke0(Native Method)
      at sun.reflect.NativeMethodAccessorImpl.invoke(NativeMethodAccessorImpl.java:57)
      at sun.reflect.DelegatingMethodAccessorImpl.invoke(DelegatingMethodAccessorImpl.java:43)
      at java.lang.reflect.Method.invoke(Method.java:601)
      at org.junit.runners.model.FrameworkMethod$1.runReflectiveCall(FrameworkMethod.java:45)
      at org.junit.internal.runners.model.ReflectiveCallable.run(ReflectiveCallable.java:15)
      at org.junit.runners.model.FrameworkMethod.invokeExplosively(FrameworkMethod.java:42)
      at org.junit.internal.runners.statements.InvokeMethod.evaluate(InvokeMethod.java:20)
      at org.junit.internal.runners.statements.RunBefores.evaluate(RunBefores.java:28)
      at org.junit.runners.ParentRunner.runLeaf(ParentRunner.java:263)
      at org.junit.runners.BlockJUnit4ClassRunner.runChild(BlockJUnit4ClassRunner.java:68)
      at org.junit.runners.BlockJUnit4ClassRunner.runChild(BlockJUnit4ClassRunner.java:47)
      at org.junit.runners.ParentRunner$3.run(ParentRunner.java:231)
      at org.junit.runners.ParentRunner$1.schedule(ParentRunner.java:60)
      at org.junit.runners.ParentRunner.runChildren(ParentRunner.java:229)
      at org.junit.runners.ParentRunner.access$000(ParentRunner.java:50)
      at org.junit.runners.ParentRunner$2.evaluate(ParentRunner.java:222)
      at org.junit.runners.ParentRunner.run(ParentRunner.java:300)
      at org.apache.maven.surefire.junit4.JUnit4Provider.execute(JUnit4Provider.java:252)
      at org.apache.maven.surefire.junit4.JUnit4Provider.executeTestSet(JUnit4Provider.java:141)
      at org.apache.maven.surefire.junit4.JUnit4Provider.invoke(JUnit4Provider.java:112)
      at sun.reflect.NativeMethodAccessorImpl.invoke0(Native Method)
      at sun.reflect.NativeMethodAccessorImpl.invoke(NativeMethodAccessorImpl.java:57)
      at sun.reflect.DelegatingMethodAccessorImpl.invoke(DelegatingMethodAccessorImpl.java:43)
      at java.lang.reflect.Method.invoke(Method.java:601)
      at org.apache.maven.surefire.util.ReflectionUtils.invokeMethodWithArray(ReflectionUtils.java:189)
      at org.apache.maven.surefire.booter.ProviderFactory$ProviderProxy.invoke(ProviderFactory.java:165)
      at org.apache.maven.surefire.booter.ProviderFactory.invokeProvider(ProviderFactory.java:85)
      at org.apache.maven.surefire.booter.ForkedBooter.runSuitesInProcess(ForkedBooter.java:115)
      at org.apache.maven.surefire.booter.ForkedBooter.main(ForkedBooter.java:75)

      testStateMachine(com.hp.mwtests.ts.arjuna.objectstore.JDBCStoreTest) Time elapsed: 0.001 sec <<< ERROR!
      com.arjuna.ats.arjuna.exceptions.ObjectStoreException: ARJUNA012263: No JDBCAccess implementation provided!
      at com.arjuna.ats.internal.arjuna.objectstore.jdbc.JDBCStore.<init>(JDBCStore.java:200)
      at com.hp.mwtests.ts.arjuna.objectstore.JDBCStoreTest.testStateMachine(JDBCStoreTest.java:69)
      at sun.reflect.NativeMethodAccessorImpl.invoke0(Native Method)
      at sun.reflect.NativeMethodAccessorImpl.invoke(NativeMethodAccessorImpl.java:57)
      at sun.reflect.DelegatingMethodAccessorImpl.invoke(DelegatingMethodAccessorImpl.java:43)
      at java.lang.reflect.Method.invoke(Method.java:601)
      at org.junit.runners.model.FrameworkMethod$1.runReflectiveCall(FrameworkMethod.java:45)
      at org.junit.internal.runners.model.ReflectiveCallable.run(ReflectiveCallable.java:15)
      at org.junit.runners.model.FrameworkMethod.invokeExplosively(FrameworkMethod.java:42)
      at org.junit.internal.runners.statements.InvokeMethod.evaluate(InvokeMethod.java:20)
      at org.junit.internal.runners.statements.RunBefores.evaluate(RunBefores.java:28)
      at org.junit.internal.runners.statements.RunAfters.evaluate(RunAfters.java:30)
      at org.junit.runners.ParentRunner.runLeaf(ParentRunner.java:263)
      at org.junit.runners.BlockJUnit4ClassRunner.runChild(BlockJUnit4ClassRunner.java:68)
      at org.junit.runners.BlockJUnit4ClassRunner.runChild(BlockJUnit4ClassRunner.java:47)
      at org.junit.runners.ParentRunner$3.run(ParentRunner.java:231)
      at org.junit.runners.ParentRunner$1.schedule(ParentRunner.java:60)
      at org.junit.runners.ParentRunner.runChildren(ParentRunner.java:229)
      at org.junit.runners.ParentRunner.access$000(ParentRunner.java:50)
      at org.junit.runners.ParentRunner$2.evaluate(ParentRunner.java:222)
      at org.junit.runners.ParentRunner.run(ParentRunner.java:300)
      at org.apache.maven.surefire.junit4.JUnit4Provider.execute(JUnit4Provider.java:252)
      at org.apache.maven.surefire.junit4.JUnit4Provider.executeTestSet(JUnit4Provider.java:141)
      at org.apache.maven.surefire.junit4.JUnit4Provider.invoke(JUnit4Provider.java:112)
      at sun.reflect.NativeMethodAccessorImpl.invoke0(Native Method)
      at sun.reflect.NativeMethodAccessorImpl.invoke(NativeMethodAccessorImpl.java:57)
      at sun.reflect.DelegatingMethodAccessorImpl.invoke(DelegatingMethodAccessorImpl.java:43)
      at java.lang.reflect.Method.invoke(Method.java:601)
      at org.apache.maven.surefire.util.ReflectionUtils.invokeMethodWithArray(ReflectionUtils.java:189)
      at org.apache.maven.surefire.booter.ProviderFactory$ProviderProxy.invoke(ProviderFactory.java:165)
      at org.apache.maven.surefire.booter.ProviderFactory.invokeProvider(ProviderFactory.java:85)
      at org.apache.maven.surefire.booter.ForkedBooter.runSuitesInProcess(ForkedBooter.java:115)
      at org.apache.maven.surefire.booter.ForkedBooter.main(ForkedBooter.java:75)

      Tests run: 1, Failures: 0, Errors: 0, Skipped: 0, Time elapsed: 0.002 sec
      Running com.hp.mwtests.ts.arjuna.objectstore.LogStoreRecoveryTest
      ^C
      Results :

      Failed tests: test(com.hp.mwtests.ts.arjuna.atomicaction.CheckedActionTest)
      testCheckedAction(com.hp.mwtests.ts.arjuna.atomicaction.CheckedActionTest)
      testGetSet(com.hp.mwtests.ts.arjuna.atomicaction.TxControlUnitTest): expected:<false> but was:<true>
      test(com.hp.mwtests.ts.arjuna.objectstore.AltStoreTest)

      Tests in error:
      testStateMachine(com.hp.mwtests.ts.arjuna.objectstore.JDBCStoreTest): ARJUNA012263: No JDBCAccess implementation provided!

      LogStoreRecoveryTest hung and I killed the build.

      It's worth noting that the build does not stop when a test fails. Furthermore, a quick look at some of the tests (e.g., CheckedActionTest) seems to indicate that perhaps the environment from previous tests has not been cleaned up before the next tests run.

        Gliffy Diagrams

          Attachments

            Issue Links

              Activity

                People

                • Assignee:
                  tomjenkinson Thomas Jenkinson
                  Reporter:
                  marklittle Mark Little
                • Votes:
                  0 Vote for this issue
                  Watchers:
                  2 Start watching this issue

                  Dates

                  • Created:
                    Updated:
                    Resolved: