Details

      Description

      See:
      http://172.17.131.2/view/Narayana+BlackTie/job/jbossts-branch416-EAP60x-java6/286
      http://172.17.131.2/view/Narayana+BlackTie/job/jbossts-branch416-EAP60x-java6/285
      http://172.17.131.2/view/Narayana+BlackTie/job/jbossts-branch416-EAP60x-java7/171/
      http://172.17.131.2/view/Narayana+BlackTie/job/jbossts-branch416-EAP60x-java7/172/

      This seems to be happening consistently, so should be easy to reproduce.

         [exec] Running org.jboss.jbossts.txbridge.tests.inbound.junit.InboundBasicTests
           [exec] Tests run: 5, Failures: 0, Errors: 0, Skipped: 0, Time elapsed: 84.154 sec
           [exec] Running org.jboss.jbossts.txbridge.tests.inbound.junit.InboundCrashRecoveryTests
           [exec] Tests run: 6, Failures: 0, Errors: 6, Skipped: 0, Time elapsed: 4,957.89 sec <<< FAILURE!
           [exec] Running org.jboss.jbossts.txbridge.tests.outbound.junit.OutboundBasicTests
           [exec] Tests run: 9, Failures: 4, Errors: 5, Skipped: 0, Time elapsed: 19.122 sec <<< FAILURE!
           [exec] Running org.jboss.jbossts.txbridge.tests.outbound.junit.OutboundCrashRecoveryTests
           [exec] Tests run: 5, Failures: 2, Errors: 2, Skipped: 1, Time elapsed: 40.417 sec <<< FAILURE!
      

        Gliffy Diagrams

          Attachments

            Activity

              People

              • Assignee:
                paul.robinson Paul Robinson
                Reporter:
                paul.robinson Paul Robinson
              • Votes:
                0 Vote for this issue
                Watchers:
                1 Start watching this issue

                Dates

                • Created:
                  Updated:
                  Resolved: