Uploaded image for project: 'Tools (JBoss Tools)'
  1. Tools (JBoss Tools)
  2. JBIDE-15133

Test failures in integrationtests site build

    Details

    • Type: Bug
    • Status: Closed (View Workflow)
    • Priority: Major
    • Resolution: Duplicate Issue
    • Affects Version/s: None
    • Fix Version/s: 4.1.1.Final
    • Component/s: build
    • Labels:
      None

      Description

      Successfully built https://jenkins.mw.lab.eng.bos.redhat.com/hudson/job/jbosstools-4.1_trunk.integrationtests.aggregate/ but these tests failed:

      [INFO] org.jboss.ide.eclipse.as.ui.bot.test .............. FAILURE [2:31.629s]
      [INFO] org.jboss.tools.cdi.reddeer ....................... FAILURE [11.814s]
      [INFO] org.jboss.tools.deltaspike.ui.bot.test ............ SKIPPED
      [INFO] org.jboss.tools.runtime.as.ui.bot.test ............ FAILURE [3:38.606s]
      

        Gliffy Diagrams

          Attachments

            Issue Links

              Activity

                People

                • Assignee:
                  mmalina Martin Malina
                  Reporter:
                  nickboldt Nick Boldt
                • Votes:
                  0 Vote for this issue
                  Watchers:
                  3 Start watching this issue

                  Dates

                  • Created:
                    Updated:
                    Resolved: