Uploaded image for project: 'Infinispan'
  1. Infinispan
  2. ISPN-9395

Failures running the test suite in Windows - karaf-maven-plugin:verify on project infinispan-commons: Unable to load features

    Details

    • Type: Bug
    • Status: Resolved (View Workflow)
    • Priority: Major
    • Resolution: Done
    • Affects Version/s: None
    • Fix Version/s: 10.0.0.Alpha3, 9.4.6.Final
    • Component/s: None
    • Labels:
      None
    • Environment:

      Windows

      Description

      [INFO] BUILD FAILURE
      [INFO] ------------------------------------------------------------------------
      [INFO] Total time: 06:24 min
      [INFO] Finished at: 2018-07-22T17:53:48Z
      [INFO] ------------------------------------------------------------------------
      [ERROR] Failed to execute goal org.apache.karaf.tooling:karaf-maven-plugin:4.2.0:verify (validate) on project infinispan-commons: Unable to load features descriptors: Error:
      [ERROR] 	Error downloading file://C:\home\jenkins\workspace\jdg-func-ispn-testsuite-windows-os_wip\11c13a93\infinispan\commons\target/classes/features.xml
      [ERROR] -> [Help 1]
      [ERROR] 
      [ERROR] To see the full stack trace of the errors, re-run Maven with the -e switch.
      [ERROR] Re-run Maven using the -X switch to enable full debug logging.
      [ERROR] 
      [ERROR] For more information about the errors and possible solutions, please read the following articles:
      [ERROR] [Help 1] http://cwiki.apache.org/confluence/display/MAVEN/MojoExecutionException
      [ERROR] 
      [ERROR] After correcting the problems, you can resume the build with the command
      [ERROR]   mvn <goals> -rf :infinispan-commons
      

        Gliffy Diagrams

          Attachments

            Activity

              People

              • Assignee:
                dan.berindei Dan Berindei
                Reporter:
                dlovison Diego Lovison
              • Votes:
                0 Vote for this issue
                Watchers:
                2 Start watching this issue

                Dates

                • Created:
                  Updated:
                  Resolved: