Details

    • Type: Bug
    • Status: Closed (View Workflow)
    • Priority: Major
    • Resolution: Done
    • Affects Version/s: None
    • Fix Version/s: 1.2.2.Final
    • Component/s: None
    • Labels:
      None
    • Environment:

      Windows 7, Maven 3.0.4, Git 1.8.0

      Description

      When running in Windows 7, the following tests fail:

      -------------------------------------------------------------------------------
      Test set: org.jboss.forge.git.gitignore.GitIgnorePluginTest
      -------------------------------------------------------------------------------
      Tests run: 6, Failures: 0, Errors: 6, Skipped: 0, Time elapsed: 43.529 sec <<< FAILURE!
      should_setup_gibo(org.jboss.forge.git.gitignore.GitIgnorePluginTest)  Time elapsed: 9.485 sec  <<< ERROR!
      java.lang.RuntimeException: failed to delete: C:\Users\GEORGE\AppData\Local\Temp\abstractshelltest2525636356887585373.tmp\test\gibo\.git\objects\pack\pack-5b17fd52f6bc027884be4ab04f8edfb7a3e62e4c.pack
      	at org.jboss.forge.resources.FileResource._deleteRecursive(FileResource.java:260)
      	at org.jboss.forge.resources.FileResource._deleteRecursive(FileResource.java:254)
      	at org.jboss.forge.resources.FileResource._deleteRecursive(FileResource.java:254)
      	at org.jboss.forge.resources.FileResource._deleteRecursive(FileResource.java:254)
      	at org.jboss.forge.resources.FileResource._deleteRecursive(FileResource.java:254)
      	at org.jboss.forge.resources.FileResource._deleteRecursive(FileResource.java:254)
      	at org.jboss.forge.resources.FileResource.delete(FileResource.java:198)
      	at org.jboss.forge.test.AbstractShellTest.afterTest(AbstractShellTest.java:207)
      	at sun.reflect.NativeMethodAccessorImpl.invoke0(Native Method)
      	at sun.reflect.NativeMethodAccessorImpl.invoke(NativeMethodAccessorImpl.java:39)
      	at sun.reflect.DelegatingMethodAccessorImpl.invoke(DelegatingMethodAccessorImpl.java:25)
      	at java.lang.reflect.Method.invoke(Method.java:597)
      	at org.junit.runners.model.FrameworkMethod$1.runReflectiveCall(FrameworkMethod.java:44)
      	at org.junit.internal.runners.model.ReflectiveCallable.run(ReflectiveCallable.java:15)
      	at org.junit.runners.model.FrameworkMethod.invokeExplosively(FrameworkMethod.java:41)
      	at org.junit.internal.runners.statements.RunAfters.evaluate(RunAfters.java:37)
      	at org.jboss.arquillian.junit.Arquillian$StatementLifecycleExecutor.invoke(Arquillian.java:351)
      	at org.jboss.arquillian.container.test.impl.execution.ClientBeforeAfterLifecycleEventExecuter.execute(ClientBeforeAfterLifecycleEventExecuter.java:99)
      	at org.jboss.arquillian.container.test.impl.execution.ClientBeforeAfterLifecycleEventExecuter.on(ClientBeforeAfterLifecycleEventExecuter.java:80)
      	at sun.reflect.NativeMethodAccessorImpl.invoke0(Native Method)
      	at sun.reflect.NativeMethodAccessorImpl.invoke(NativeMethodAccessorImpl.java:39)
      	at sun.reflect.DelegatingMethodAccessorImpl.invoke(DelegatingMethodAccessorImpl.java:25)
      	at java.lang.reflect.Method.invoke(Method.java:597)
      	at org.jboss.arquillian.core.impl.ObserverImpl.invoke(ObserverImpl.java:90)
      	at org.jboss.arquillian.core.impl.EventContextImpl.invokeObservers(EventContextImpl.java:99)
      	at org.jboss.arquillian.core.impl.EventContextImpl.proceed(EventContextImpl.java:81)
      	at org.jboss.arquillian.testenricher.cdi.CreationalContextDestroyer.destory(CreationalContextDestroyer.java:44)
      	at sun.reflect.NativeMethodAccessorImpl.invoke0(Native Method)
      	at sun.reflect.NativeMethodAccessorImpl.invoke(NativeMethodAccessorImpl.java:39)
      	at sun.reflect.DelegatingMethodAccessorImpl.invoke(DelegatingMethodAccessorImpl.java:25)
      	at java.lang.reflect.Method.invoke(Method.java:597)
      	at org.jboss.arquillian.core.impl.ObserverImpl.invoke(ObserverImpl.java:90)
      	at org.jboss.arquillian.core.impl.EventContextImpl.proceed(EventContextImpl.java:88)
      	at org.jboss.arquillian.container.test.impl.client.ContainerEventController.createContext(ContainerEventController.java:142)
      	at org.jboss.arquillian.container.test.impl.client.ContainerEventController.createAfterContext(ContainerEventController.java:134)
      	at sun.reflect.NativeMethodAccessorImpl.invoke0(Native Method)
      	at sun.reflect.NativeMethodAccessorImpl.invoke(NativeMethodAccessorImpl.java:39)
      	at sun.reflect.DelegatingMethodAccessorImpl.invoke(DelegatingMethodAccessorImpl.java:25)
      	at java.lang.reflect.Method.invoke(Method.java:597)
      	at org.jboss.arquillian.core.impl.ObserverImpl.invoke(ObserverImpl.java:90)
      	at org.jboss.arquillian.core.impl.EventContextImpl.proceed(EventContextImpl.java:88)
      	at org.jboss.arquillian.test.impl.TestContextHandler.createTestContext(TestContextHandler.java:89)
      	at sun.reflect.NativeMethodAccessorImpl.invoke0(Native Method)
      	at sun.reflect.NativeMethodAccessorImpl.invoke(NativeMethodAccessorImpl.java:39)
      	at sun.reflect.DelegatingMethodAccessorImpl.invoke(DelegatingMethodAccessorImpl.java:25)
      	at java.lang.reflect.Method.invoke(Method.java:597)
      	at org.jboss.arquillian.core.impl.ObserverImpl.invoke(ObserverImpl.java:90)
      	at org.jboss.arquillian.core.impl.EventContextImpl.proceed(EventContextImpl.java:88)
      	at org.jboss.arquillian.test.impl.TestContextHandler.createClassContext(TestContextHandler.java:75)
      	at sun.reflect.NativeMethodAccessorImpl.invoke0(Native Method)
      	at sun.reflect.NativeMethodAccessorImpl.invoke(NativeMethodAccessorImpl.java:39)
      	at sun.reflect.DelegatingMethodAccessorImpl.invoke(DelegatingMethodAccessorImpl.java:25)
      	at java.lang.reflect.Method.invoke(Method.java:597)
      	at org.jboss.arquillian.core.impl.ObserverImpl.invoke(ObserverImpl.java:90)
      	at org.jboss.arquillian.core.impl.EventContextImpl.proceed(EventContextImpl.java:88)
      	at org.jboss.arquillian.test.impl.TestContextHandler.createSuiteContext(TestContextHandler.java:60)
      	at sun.reflect.NativeMethodAccessorImpl.invoke0(Native Method)
      	at sun.reflect.NativeMethodAccessorImpl.invoke(NativeMethodAccessorImpl.java:39)
      	at sun.reflect.DelegatingMethodAccessorImpl.invoke(DelegatingMethodAccessorImpl.java:25)
      	at java.lang.reflect.Method.invoke(Method.java:597)
      	at org.jboss.arquillian.core.impl.ObserverImpl.invoke(ObserverImpl.java:90)
      	at org.jboss.arquillian.core.impl.EventContextImpl.proceed(EventContextImpl.java:88)
      	at org.jboss.arquillian.core.impl.ManagerImpl.fire(ManagerImpl.java:134)
      	at org.jboss.arquillian.core.impl.ManagerImpl.fire(ManagerImpl.java:114)
      	at org.jboss.arquillian.test.impl.EventTestRunnerAdaptor.after(EventTestRunnerAdaptor.java:103)
      	at org.jboss.arquillian.junit.Arquillian$5$1.evaluate(Arquillian.java:245)
      	at org.jboss.arquillian.junit.Arquillian.multiExecute(Arquillian.java:314)
      	at org.jboss.arquillian.junit.Arquillian.access$100(Arquillian.java:46)
      	at org.jboss.arquillian.junit.Arquillian$5.evaluate(Arquillian.java:240)
      	at org.junit.runners.BlockJUnit4ClassRunner.runChild(BlockJUnit4ClassRunner.java:76)
      	at org.junit.runners.BlockJUnit4ClassRunner.runChild(BlockJUnit4ClassRunner.java:50)
      	at org.junit.runners.ParentRunner$3.run(ParentRunner.java:193)
      	at org.junit.runners.ParentRunner$1.schedule(ParentRunner.java:52)
      	at org.junit.runners.ParentRunner.runChildren(ParentRunner.java:191)
      	at org.junit.runners.ParentRunner.access$000(ParentRunner.java:42)
      	at org.junit.runners.ParentRunner$2.evaluate(ParentRunner.java:184)
      	at org.jboss.arquillian.junit.Arquillian$2.evaluate(Arquillian.java:185)
      	at org.jboss.arquillian.junit.Arquillian.multiExecute(Arquillian.java:314)
      	at org.jboss.arquillian.junit.Arquillian.access$100(Arquillian.java:46)
      	at org.jboss.arquillian.junit.Arquillian$3.evaluate(Arquillian.java:199)
      	at org.junit.runners.ParentRunner.run(ParentRunner.java:236)
      	at org.jboss.arquillian.junit.Arquillian.run(Arquillian.java:147)
      	at org.apache.maven.surefire.junit4.JUnit4Provider.execute(JUnit4Provider.java:236)
      	at org.apache.maven.surefire.junit4.JUnit4Provider.executeTestSet(JUnit4Provider.java:134)
      	at org.apache.maven.surefire.junit4.JUnit4Provider.invoke(JUnit4Provider.java:113)
      	at sun.reflect.NativeMethodAccessorImpl.invoke0(Native Method)
      	at sun.reflect.NativeMethodAccessorImpl.invoke(NativeMethodAccessorImpl.java:39)
      	at sun.reflect.DelegatingMethodAccessorImpl.invoke(DelegatingMethodAccessorImpl.java:25)
      	at java.lang.reflect.Method.invoke(Method.java:597)
      	at org.apache.maven.surefire.util.ReflectionUtils.invokeMethodWithArray(ReflectionUtils.java:189)
      	at org.apache.maven.surefire.booter.ProviderFactory$ProviderProxy.invoke(ProviderFactory.java:165)
      	at org.apache.maven.surefire.booter.ProviderFactory.invokeProvider(ProviderFactory.java:85)
      	at org.apache.maven.surefire.booter.ForkedBooter.runSuitesInProcess(ForkedBooter.java:103)
      	at org.apache.maven.surefire.booter.ForkedBooter.main(ForkedBooter.java:74)
      should_update_gibo(org.jboss.forge.git.gitignore.GitIgnorePluginTest)  Time elapsed: 5.219 sec  <<< ERROR!
      java.lang.RuntimeException: failed to delete: C:\Users\GEORGE\AppData\Local\Temp\abstractshelltest6167794437463620993.tmp\test\gibo\.git\objects\pack\pack-5b17fd52f6bc027884be4ab04f8edfb7a3e62e4c.pack
      	at org.jboss.forge.resources.FileResource._deleteRecursive(FileResource.java:260)
      	at org.jboss.forge.resources.FileResource._deleteRecursive(FileResource.java:254)
      	at org.jboss.forge.resources.FileResource._deleteRecursive(FileResource.java:254)
      	at org.jboss.forge.resources.FileResource._deleteRecursive(FileResource.java:254)
      	at org.jboss.forge.resources.FileResource._deleteRecursive(FileResource.java:254)
      	at org.jboss.forge.resources.FileResource._deleteRecursive(FileResource.java:254)
      	at org.jboss.forge.resources.FileResource.delete(FileResource.java:198)
      	at org.jboss.forge.test.AbstractShellTest.afterTest(AbstractShellTest.java:207)
      	at sun.reflect.NativeMethodAccessorImpl.invoke0(Native Method)
      	at sun.reflect.NativeMethodAccessorImpl.invoke(NativeMethodAccessorImpl.java:39)
      	at sun.reflect.DelegatingMethodAccessorImpl.invoke(DelegatingMethodAccessorImpl.java:25)
      	at java.lang.reflect.Method.invoke(Method.java:597)
      	at org.junit.runners.model.FrameworkMethod$1.runReflectiveCall(FrameworkMethod.java:44)
      	at org.junit.internal.runners.model.ReflectiveCallable.run(ReflectiveCallable.java:15)
      	at org.junit.runners.model.FrameworkMethod.invokeExplosively(FrameworkMethod.java:41)
      	at org.junit.internal.runners.statements.RunAfters.evaluate(RunAfters.java:37)
      	at org.jboss.arquillian.junit.Arquillian$StatementLifecycleExecutor.invoke(Arquillian.java:351)
      	at org.jboss.arquillian.container.test.impl.execution.ClientBeforeAfterLifecycleEventExecuter.execute(ClientBeforeAfterLifecycleEventExecuter.java:99)
      	at org.jboss.arquillian.container.test.impl.execution.ClientBeforeAfterLifecycleEventExecuter.on(ClientBeforeAfterLifecycleEventExecuter.java:80)
      	at sun.reflect.NativeMethodAccessorImpl.invoke0(Native Method)
      	at sun.reflect.NativeMethodAccessorImpl.invoke(NativeMethodAccessorImpl.java:39)
      	at sun.reflect.DelegatingMethodAccessorImpl.invoke(DelegatingMethodAccessorImpl.java:25)
      	at java.lang.reflect.Method.invoke(Method.java:597)
      	at org.jboss.arquillian.core.impl.ObserverImpl.invoke(ObserverImpl.java:90)
      	at org.jboss.arquillian.core.impl.EventContextImpl.invokeObservers(EventContextImpl.java:99)
      	at org.jboss.arquillian.core.impl.EventContextImpl.proceed(EventContextImpl.java:81)
      	at org.jboss.arquillian.testenricher.cdi.CreationalContextDestroyer.destory(CreationalContextDestroyer.java:44)
      	at sun.reflect.NativeMethodAccessorImpl.invoke0(Native Method)
      	at sun.reflect.NativeMethodAccessorImpl.invoke(NativeMethodAccessorImpl.java:39)
      	at sun.reflect.DelegatingMethodAccessorImpl.invoke(DelegatingMethodAccessorImpl.java:25)
      	at java.lang.reflect.Method.invoke(Method.java:597)
      	at org.jboss.arquillian.core.impl.ObserverImpl.invoke(ObserverImpl.java:90)
      	at org.jboss.arquillian.core.impl.EventContextImpl.proceed(EventContextImpl.java:88)
      	at org.jboss.arquillian.container.test.impl.client.ContainerEventController.createContext(ContainerEventController.java:142)
      	at org.jboss.arquillian.container.test.impl.client.ContainerEventController.createAfterContext(ContainerEventController.java:134)
      	at sun.reflect.NativeMethodAccessorImpl.invoke0(Native Method)
      	at sun.reflect.NativeMethodAccessorImpl.invoke(NativeMethodAccessorImpl.java:39)
      	at sun.reflect.DelegatingMethodAccessorImpl.invoke(DelegatingMethodAccessorImpl.java:25)
      	at java.lang.reflect.Method.invoke(Method.java:597)
      	at org.jboss.arquillian.core.impl.ObserverImpl.invoke(ObserverImpl.java:90)
      	at org.jboss.arquillian.core.impl.EventContextImpl.proceed(EventContextImpl.java:88)
      	at org.jboss.arquillian.test.impl.TestContextHandler.createTestContext(TestContextHandler.java:89)
      	at sun.reflect.NativeMethodAccessorImpl.invoke0(Native Method)
      	at sun.reflect.NativeMethodAccessorImpl.invoke(NativeMethodAccessorImpl.java:39)
      	at sun.reflect.DelegatingMethodAccessorImpl.invoke(DelegatingMethodAccessorImpl.java:25)
      	at java.lang.reflect.Method.invoke(Method.java:597)
      	at org.jboss.arquillian.core.impl.ObserverImpl.invoke(ObserverImpl.java:90)
      	at org.jboss.arquillian.core.impl.EventContextImpl.proceed(EventContextImpl.java:88)
      	at org.jboss.arquillian.test.impl.TestContextHandler.createClassContext(TestContextHandler.java:75)
      	at sun.reflect.NativeMethodAccessorImpl.invoke0(Native Method)
      	at sun.reflect.NativeMethodAccessorImpl.invoke(NativeMethodAccessorImpl.java:39)
      	at sun.reflect.DelegatingMethodAccessorImpl.invoke(DelegatingMethodAccessorImpl.java:25)
      	at java.lang.reflect.Method.invoke(Method.java:597)
      	at org.jboss.arquillian.core.impl.ObserverImpl.invoke(ObserverImpl.java:90)
      	at org.jboss.arquillian.core.impl.EventContextImpl.proceed(EventContextImpl.java:88)
      	at org.jboss.arquillian.test.impl.TestContextHandler.createSuiteContext(TestContextHandler.java:60)
      	at sun.reflect.NativeMethodAccessorImpl.invoke0(Native Method)
      	at sun.reflect.NativeMethodAccessorImpl.invoke(NativeMethodAccessorImpl.java:39)
      	at sun.reflect.DelegatingMethodAccessorImpl.invoke(DelegatingMethodAccessorImpl.java:25)
      	at java.lang.reflect.Method.invoke(Method.java:597)
      	at org.jboss.arquillian.core.impl.ObserverImpl.invoke(ObserverImpl.java:90)
      	at org.jboss.arquillian.core.impl.EventContextImpl.proceed(EventContextImpl.java:88)
      	at org.jboss.arquillian.core.impl.ManagerImpl.fire(ManagerImpl.java:134)
      	at org.jboss.arquillian.core.impl.ManagerImpl.fire(ManagerImpl.java:114)
      	at org.jboss.arquillian.test.impl.EventTestRunnerAdaptor.after(EventTestRunnerAdaptor.java:103)
      	at org.jboss.arquillian.junit.Arquillian$5$1.evaluate(Arquillian.java:245)
      	at org.jboss.arquillian.junit.Arquillian.multiExecute(Arquillian.java:314)
      	at org.jboss.arquillian.junit.Arquillian.access$100(Arquillian.java:46)
      	at org.jboss.arquillian.junit.Arquillian$5.evaluate(Arquillian.java:240)
      	at org.junit.runners.BlockJUnit4ClassRunner.runChild(BlockJUnit4ClassRunner.java:76)
      	at org.junit.runners.BlockJUnit4ClassRunner.runChild(BlockJUnit4ClassRunner.java:50)
      	at org.junit.runners.ParentRunner$3.run(ParentRunner.java:193)
      	at org.junit.runners.ParentRunner$1.schedule(ParentRunner.java:52)
      	at org.junit.runners.ParentRunner.runChildren(ParentRunner.java:191)
      	at org.junit.runners.ParentRunner.access$000(ParentRunner.java:42)
      	at org.junit.runners.ParentRunner$2.evaluate(ParentRunner.java:184)
      	at org.jboss.arquillian.junit.Arquillian$2.evaluate(Arquillian.java:185)
      	at org.jboss.arquillian.junit.Arquillian.multiExecute(Arquillian.java:314)
      	at org.jboss.arquillian.junit.Arquillian.access$100(Arquillian.java:46)
      	at org.jboss.arquillian.junit.Arquillian$3.evaluate(Arquillian.java:199)
      	at org.junit.runners.ParentRunner.run(ParentRunner.java:236)
      	at org.jboss.arquillian.junit.Arquillian.run(Arquillian.java:147)
      	at org.apache.maven.surefire.junit4.JUnit4Provider.execute(JUnit4Provider.java:236)
      	at org.apache.maven.surefire.junit4.JUnit4Provider.executeTestSet(JUnit4Provider.java:134)
      	at org.apache.maven.surefire.junit4.JUnit4Provider.invoke(JUnit4Provider.java:113)
      	at sun.reflect.NativeMethodAccessorImpl.invoke0(Native Method)
      	at sun.reflect.NativeMethodAccessorImpl.invoke(NativeMethodAccessorImpl.java:39)
      	at sun.reflect.DelegatingMethodAccessorImpl.invoke(DelegatingMethodAccessorImpl.java:25)
      	at java.lang.reflect.Method.invoke(Method.java:597)
      	at org.apache.maven.surefire.util.ReflectionUtils.invokeMethodWithArray(ReflectionUtils.java:189)
      	at org.apache.maven.surefire.booter.ProviderFactory$ProviderProxy.invoke(ProviderFactory.java:165)
      	at org.apache.maven.surefire.booter.ProviderFactory.invokeProvider(ProviderFactory.java:85)
      	at org.apache.maven.surefire.booter.ForkedBooter.runSuitesInProcess(ForkedBooter.java:103)
      	at org.apache.maven.surefire.booter.ForkedBooter.main(ForkedBooter.java:74)
      should_list_templates(org.jboss.forge.git.gitignore.GitIgnorePluginTest)  Time elapsed: 4.887 sec  <<< ERROR!
      java.lang.RuntimeException: failed to delete: C:\Users\GEORGE\AppData\Local\Temp\abstractshelltest1022910099752531772.tmp\test\gibo\.git\objects\pack\pack-5b17fd52f6bc027884be4ab04f8edfb7a3e62e4c.pack
      	at org.jboss.forge.resources.FileResource._deleteRecursive(FileResource.java:260)
      	at org.jboss.forge.resources.FileResource._deleteRecursive(FileResource.java:254)
      	at org.jboss.forge.resources.FileResource._deleteRecursive(FileResource.java:254)
      	at org.jboss.forge.resources.FileResource._deleteRecursive(FileResource.java:254)
      	at org.jboss.forge.resources.FileResource._deleteRecursive(FileResource.java:254)
      	at org.jboss.forge.resources.FileResource._deleteRecursive(FileResource.java:254)
      	at org.jboss.forge.resources.FileResource.delete(FileResource.java:198)
      	at org.jboss.forge.test.AbstractShellTest.afterTest(AbstractShellTest.java:207)
      	at sun.reflect.NativeMethodAccessorImpl.invoke0(Native Method)
      	at sun.reflect.NativeMethodAccessorImpl.invoke(NativeMethodAccessorImpl.java:39)
      	at sun.reflect.DelegatingMethodAccessorImpl.invoke(DelegatingMethodAccessorImpl.java:25)
      	at java.lang.reflect.Method.invoke(Method.java:597)
      	at org.junit.runners.model.FrameworkMethod$1.runReflectiveCall(FrameworkMethod.java:44)
      	at org.junit.internal.runners.model.ReflectiveCallable.run(ReflectiveCallable.java:15)
      	at org.junit.runners.model.FrameworkMethod.invokeExplosively(FrameworkMethod.java:41)
      	at org.junit.internal.runners.statements.RunAfters.evaluate(RunAfters.java:37)
      	at org.jboss.arquillian.junit.Arquillian$StatementLifecycleExecutor.invoke(Arquillian.java:351)
      	at org.jboss.arquillian.container.test.impl.execution.ClientBeforeAfterLifecycleEventExecuter.execute(ClientBeforeAfterLifecycleEventExecuter.java:99)
      	at org.jboss.arquillian.container.test.impl.execution.ClientBeforeAfterLifecycleEventExecuter.on(ClientBeforeAfterLifecycleEventExecuter.java:80)
      	at sun.reflect.NativeMethodAccessorImpl.invoke0(Native Method)
      	at sun.reflect.NativeMethodAccessorImpl.invoke(NativeMethodAccessorImpl.java:39)
      	at sun.reflect.DelegatingMethodAccessorImpl.invoke(DelegatingMethodAccessorImpl.java:25)
      	at java.lang.reflect.Method.invoke(Method.java:597)
      	at org.jboss.arquillian.core.impl.ObserverImpl.invoke(ObserverImpl.java:90)
      	at org.jboss.arquillian.core.impl.EventContextImpl.invokeObservers(EventContextImpl.java:99)
      	at org.jboss.arquillian.core.impl.EventContextImpl.proceed(EventContextImpl.java:81)
      	at org.jboss.arquillian.testenricher.cdi.CreationalContextDestroyer.destory(CreationalContextDestroyer.java:44)
      	at sun.reflect.NativeMethodAccessorImpl.invoke0(Native Method)
      	at sun.reflect.NativeMethodAccessorImpl.invoke(NativeMethodAccessorImpl.java:39)
      	at sun.reflect.DelegatingMethodAccessorImpl.invoke(DelegatingMethodAccessorImpl.java:25)
      	at java.lang.reflect.Method.invoke(Method.java:597)
      	at org.jboss.arquillian.core.impl.ObserverImpl.invoke(ObserverImpl.java:90)
      	at org.jboss.arquillian.core.impl.EventContextImpl.proceed(EventContextImpl.java:88)
      	at org.jboss.arquillian.container.test.impl.client.ContainerEventController.createContext(ContainerEventController.java:142)
      	at org.jboss.arquillian.container.test.impl.client.ContainerEventController.createAfterContext(ContainerEventController.java:134)
      	at sun.reflect.NativeMethodAccessorImpl.invoke0(Native Method)
      	at sun.reflect.NativeMethodAccessorImpl.invoke(NativeMethodAccessorImpl.java:39)
      	at sun.reflect.DelegatingMethodAccessorImpl.invoke(DelegatingMethodAccessorImpl.java:25)
      	at java.lang.reflect.Method.invoke(Method.java:597)
      	at org.jboss.arquillian.core.impl.ObserverImpl.invoke(ObserverImpl.java:90)
      	at org.jboss.arquillian.core.impl.EventContextImpl.proceed(EventContextImpl.java:88)
      	at org.jboss.arquillian.test.impl.TestContextHandler.createTestContext(TestContextHandler.java:89)
      	at sun.reflect.NativeMethodAccessorImpl.invoke0(Native Method)
      	at sun.reflect.NativeMethodAccessorImpl.invoke(NativeMethodAccessorImpl.java:39)
      	at sun.reflect.DelegatingMethodAccessorImpl.invoke(DelegatingMethodAccessorImpl.java:25)
      	at java.lang.reflect.Method.invoke(Method.java:597)
      	at org.jboss.arquillian.core.impl.ObserverImpl.invoke(ObserverImpl.java:90)
      	at org.jboss.arquillian.core.impl.EventContextImpl.proceed(EventContextImpl.java:88)
      	at org.jboss.arquillian.test.impl.TestContextHandler.createClassContext(TestContextHandler.java:75)
      	at sun.reflect.NativeMethodAccessorImpl.invoke0(Native Method)
      	at sun.reflect.NativeMethodAccessorImpl.invoke(NativeMethodAccessorImpl.java:39)
      	at sun.reflect.DelegatingMethodAccessorImpl.invoke(DelegatingMethodAccessorImpl.java:25)
      	at java.lang.reflect.Method.invoke(Method.java:597)
      	at org.jboss.arquillian.core.impl.ObserverImpl.invoke(ObserverImpl.java:90)
      	at org.jboss.arquillian.core.impl.EventContextImpl.proceed(EventContextImpl.java:88)
      	at org.jboss.arquillian.test.impl.TestContextHandler.createSuiteContext(TestContextHandler.java:60)
      	at sun.reflect.NativeMethodAccessorImpl.invoke0(Native Method)
      	at sun.reflect.NativeMethodAccessorImpl.invoke(NativeMethodAccessorImpl.java:39)
      	at sun.reflect.DelegatingMethodAccessorImpl.invoke(DelegatingMethodAccessorImpl.java:25)
      	at java.lang.reflect.Method.invoke(Method.java:597)
      	at org.jboss.arquillian.core.impl.ObserverImpl.invoke(ObserverImpl.java:90)
      	at org.jboss.arquillian.core.impl.EventContextImpl.proceed(EventContextImpl.java:88)
      	at org.jboss.arquillian.core.impl.ManagerImpl.fire(ManagerImpl.java:134)
      	at org.jboss.arquillian.core.impl.ManagerImpl.fire(ManagerImpl.java:114)
      	at org.jboss.arquillian.test.impl.EventTestRunnerAdaptor.after(EventTestRunnerAdaptor.java:103)
      	at org.jboss.arquillian.junit.Arquillian$5$1.evaluate(Arquillian.java:245)
      	at org.jboss.arquillian.junit.Arquillian.multiExecute(Arquillian.java:314)
      	at org.jboss.arquillian.junit.Arquillian.access$100(Arquillian.java:46)
      	at org.jboss.arquillian.junit.Arquillian$5.evaluate(Arquillian.java:240)
      	at org.junit.runners.BlockJUnit4ClassRunner.runChild(BlockJUnit4ClassRunner.java:76)
      	at org.junit.runners.BlockJUnit4ClassRunner.runChild(BlockJUnit4ClassRunner.java:50)
      	at org.junit.runners.ParentRunner$3.run(ParentRunner.java:193)
      	at org.junit.runners.ParentRunner$1.schedule(ParentRunner.java:52)
      	at org.junit.runners.ParentRunner.runChildren(ParentRunner.java:191)
      	at org.junit.runners.ParentRunner.access$000(ParentRunner.java:42)
      	at org.junit.runners.ParentRunner$2.evaluate(ParentRunner.java:184)
      	at org.jboss.arquillian.junit.Arquillian$2.evaluate(Arquillian.java:185)
      	at org.jboss.arquillian.junit.Arquillian.multiExecute(Arquillian.java:314)
      	at org.jboss.arquillian.junit.Arquillian.access$100(Arquillian.java:46)
      	at org.jboss.arquillian.junit.Arquillian$3.evaluate(Arquillian.java:199)
      	at org.junit.runners.ParentRunner.run(ParentRunner.java:236)
      	at org.jboss.arquillian.junit.Arquillian.run(Arquillian.java:147)
      	at org.apache.maven.surefire.junit4.JUnit4Provider.execute(JUnit4Provider.java:236)
      	at org.apache.maven.surefire.junit4.JUnit4Provider.executeTestSet(JUnit4Provider.java:134)
      	at org.apache.maven.surefire.junit4.JUnit4Provider.invoke(JUnit4Provider.java:113)
      	at sun.reflect.NativeMethodAccessorImpl.invoke0(Native Method)
      	at sun.reflect.NativeMethodAccessorImpl.invoke(NativeMethodAccessorImpl.java:39)
      	at sun.reflect.DelegatingMethodAccessorImpl.invoke(DelegatingMethodAccessorImpl.java:25)
      	at java.lang.reflect.Method.invoke(Method.java:597)
      	at org.apache.maven.surefire.util.ReflectionUtils.invokeMethodWithArray(ReflectionUtils.java:189)
      	at org.apache.maven.surefire.booter.ProviderFactory$ProviderProxy.invoke(ProviderFactory.java:165)
      	at org.apache.maven.surefire.booter.ProviderFactory.invokeProvider(ProviderFactory.java:85)
      	at org.apache.maven.surefire.booter.ForkedBooter.runSuitesInProcess(ForkedBooter.java:103)
      	at org.apache.maven.surefire.booter.ForkedBooter.main(ForkedBooter.java:74)
      should_create_gitignore(org.jboss.forge.git.gitignore.GitIgnorePluginTest)  Time elapsed: 6.199 sec  <<< ERROR!
      java.lang.RuntimeException: failed to delete: C:\Users\GEORGE\AppData\Local\Temp\abstractshelltest6941045159399005402.tmp\test\gibo\.git\objects\pack\pack-5b17fd52f6bc027884be4ab04f8edfb7a3e62e4c.pack
      	at org.jboss.forge.resources.FileResource._deleteRecursive(FileResource.java:260)
      	at org.jboss.forge.resources.FileResource._deleteRecursive(FileResource.java:254)
      	at org.jboss.forge.resources.FileResource._deleteRecursive(FileResource.java:254)
      	at org.jboss.forge.resources.FileResource._deleteRecursive(FileResource.java:254)
      	at org.jboss.forge.resources.FileResource._deleteRecursive(FileResource.java:254)
      	at org.jboss.forge.resources.FileResource._deleteRecursive(FileResource.java:254)
      	at org.jboss.forge.resources.FileResource.delete(FileResource.java:198)
      	at org.jboss.forge.test.AbstractShellTest.afterTest(AbstractShellTest.java:207)
      	at sun.reflect.NativeMethodAccessorImpl.invoke0(Native Method)
      	at sun.reflect.NativeMethodAccessorImpl.invoke(NativeMethodAccessorImpl.java:39)
      	at sun.reflect.DelegatingMethodAccessorImpl.invoke(DelegatingMethodAccessorImpl.java:25)
      	at java.lang.reflect.Method.invoke(Method.java:597)
      	at org.junit.runners.model.FrameworkMethod$1.runReflectiveCall(FrameworkMethod.java:44)
      	at org.junit.internal.runners.model.ReflectiveCallable.run(ReflectiveCallable.java:15)
      	at org.junit.runners.model.FrameworkMethod.invokeExplosively(FrameworkMethod.java:41)
      	at org.junit.internal.runners.statements.RunAfters.evaluate(RunAfters.java:37)
      	at org.jboss.arquillian.junit.Arquillian$StatementLifecycleExecutor.invoke(Arquillian.java:351)
      	at org.jboss.arquillian.container.test.impl.execution.ClientBeforeAfterLifecycleEventExecuter.execute(ClientBeforeAfterLifecycleEventExecuter.java:99)
      	at org.jboss.arquillian.container.test.impl.execution.ClientBeforeAfterLifecycleEventExecuter.on(ClientBeforeAfterLifecycleEventExecuter.java:80)
      	at sun.reflect.NativeMethodAccessorImpl.invoke0(Native Method)
      	at sun.reflect.NativeMethodAccessorImpl.invoke(NativeMethodAccessorImpl.java:39)
      	at sun.reflect.DelegatingMethodAccessorImpl.invoke(DelegatingMethodAccessorImpl.java:25)
      	at java.lang.reflect.Method.invoke(Method.java:597)
      	at org.jboss.arquillian.core.impl.ObserverImpl.invoke(ObserverImpl.java:90)
      	at org.jboss.arquillian.core.impl.EventContextImpl.invokeObservers(EventContextImpl.java:99)
      	at org.jboss.arquillian.core.impl.EventContextImpl.proceed(EventContextImpl.java:81)
      	at org.jboss.arquillian.testenricher.cdi.CreationalContextDestroyer.destory(CreationalContextDestroyer.java:44)
      	at sun.reflect.NativeMethodAccessorImpl.invoke0(Native Method)
      	at sun.reflect.NativeMethodAccessorImpl.invoke(NativeMethodAccessorImpl.java:39)
      	at sun.reflect.DelegatingMethodAccessorImpl.invoke(DelegatingMethodAccessorImpl.java:25)
      	at java.lang.reflect.Method.invoke(Method.java:597)
      	at org.jboss.arquillian.core.impl.ObserverImpl.invoke(ObserverImpl.java:90)
      	at org.jboss.arquillian.core.impl.EventContextImpl.proceed(EventContextImpl.java:88)
      	at org.jboss.arquillian.container.test.impl.client.ContainerEventController.createContext(ContainerEventController.java:142)
      	at org.jboss.arquillian.container.test.impl.client.ContainerEventController.createAfterContext(ContainerEventController.java:134)
      	at sun.reflect.NativeMethodAccessorImpl.invoke0(Native Method)
      	at sun.reflect.NativeMethodAccessorImpl.invoke(NativeMethodAccessorImpl.java:39)
      	at sun.reflect.DelegatingMethodAccessorImpl.invoke(DelegatingMethodAccessorImpl.java:25)
      	at java.lang.reflect.Method.invoke(Method.java:597)
      	at org.jboss.arquillian.core.impl.ObserverImpl.invoke(ObserverImpl.java:90)
      	at org.jboss.arquillian.core.impl.EventContextImpl.proceed(EventContextImpl.java:88)
      	at org.jboss.arquillian.test.impl.TestContextHandler.createTestContext(TestContextHandler.java:89)
      	at sun.reflect.NativeMethodAccessorImpl.invoke0(Native Method)
      	at sun.reflect.NativeMethodAccessorImpl.invoke(NativeMethodAccessorImpl.java:39)
      	at sun.reflect.DelegatingMethodAccessorImpl.invoke(DelegatingMethodAccessorImpl.java:25)
      	at java.lang.reflect.Method.invoke(Method.java:597)
      	at org.jboss.arquillian.core.impl.ObserverImpl.invoke(ObserverImpl.java:90)
      	at org.jboss.arquillian.core.impl.EventContextImpl.proceed(EventContextImpl.java:88)
      	at org.jboss.arquillian.test.impl.TestContextHandler.createClassContext(TestContextHandler.java:75)
      	at sun.reflect.NativeMethodAccessorImpl.invoke0(Native Method)
      	at sun.reflect.NativeMethodAccessorImpl.invoke(NativeMethodAccessorImpl.java:39)
      	at sun.reflect.DelegatingMethodAccessorImpl.invoke(DelegatingMethodAccessorImpl.java:25)
      	at java.lang.reflect.Method.invoke(Method.java:597)
      	at org.jboss.arquillian.core.impl.ObserverImpl.invoke(ObserverImpl.java:90)
      	at org.jboss.arquillian.core.impl.EventContextImpl.proceed(EventContextImpl.java:88)
      	at org.jboss.arquillian.test.impl.TestContextHandler.createSuiteContext(TestContextHandler.java:60)
      	at sun.reflect.NativeMethodAccessorImpl.invoke0(Native Method)
      	at sun.reflect.NativeMethodAccessorImpl.invoke(NativeMethodAccessorImpl.java:39)
      	at sun.reflect.DelegatingMethodAccessorImpl.invoke(DelegatingMethodAccessorImpl.java:25)
      	at java.lang.reflect.Method.invoke(Method.java:597)
      	at org.jboss.arquillian.core.impl.ObserverImpl.invoke(ObserverImpl.java:90)
      	at org.jboss.arquillian.core.impl.EventContextImpl.proceed(EventContextImpl.java:88)
      	at org.jboss.arquillian.core.impl.ManagerImpl.fire(ManagerImpl.java:134)
      	at org.jboss.arquillian.core.impl.ManagerImpl.fire(ManagerImpl.java:114)
      	at org.jboss.arquillian.test.impl.EventTestRunnerAdaptor.after(EventTestRunnerAdaptor.java:103)
      	at org.jboss.arquillian.junit.Arquillian$5$1.evaluate(Arquillian.java:245)
      	at org.jboss.arquillian.junit.Arquillian.multiExecute(Arquillian.java:314)
      	at org.jboss.arquillian.junit.Arquillian.access$100(Arquillian.java:46)
      	at org.jboss.arquillian.junit.Arquillian$5.evaluate(Arquillian.java:240)
      	at org.junit.runners.BlockJUnit4ClassRunner.runChild(BlockJUnit4ClassRunner.java:76)
      	at org.junit.runners.BlockJUnit4ClassRunner.runChild(BlockJUnit4ClassRunner.java:50)
      	at org.junit.runners.ParentRunner$3.run(ParentRunner.java:193)
      	at org.junit.runners.ParentRunner$1.schedule(ParentRunner.java:52)
      	at org.junit.runners.ParentRunner.runChildren(ParentRunner.java:191)
      	at org.junit.runners.ParentRunner.access$000(ParentRunner.java:42)
      	at org.junit.runners.ParentRunner$2.evaluate(ParentRunner.java:184)
      	at org.jboss.arquillian.junit.Arquillian$2.evaluate(Arquillian.java:185)
      	at org.jboss.arquillian.junit.Arquillian.multiExecute(Arquillian.java:314)
      	at org.jboss.arquillian.junit.Arquillian.access$100(Arquillian.java:46)
      	at org.jboss.arquillian.junit.Arquillian$3.evaluate(Arquillian.java:199)
      	at org.junit.runners.ParentRunner.run(ParentRunner.java:236)
      	at org.jboss.arquillian.junit.Arquillian.run(Arquillian.java:147)
      	at org.apache.maven.surefire.junit4.JUnit4Provider.execute(JUnit4Provider.java:236)
      	at org.apache.maven.surefire.junit4.JUnit4Provider.executeTestSet(JUnit4Provider.java:134)
      	at org.apache.maven.surefire.junit4.JUnit4Provider.invoke(JUnit4Provider.java:113)
      	at sun.reflect.NativeMethodAccessorImpl.invoke0(Native Method)
      	at sun.reflect.NativeMethodAccessorImpl.invoke(NativeMethodAccessorImpl.java:39)
      	at sun.reflect.DelegatingMethodAccessorImpl.invoke(DelegatingMethodAccessorImpl.java:25)
      	at java.lang.reflect.Method.invoke(Method.java:597)
      	at org.apache.maven.surefire.util.ReflectionUtils.invokeMethodWithArray(ReflectionUtils.java:189)
      	at org.apache.maven.surefire.booter.ProviderFactory$ProviderProxy.invoke(ProviderFactory.java:165)
      	at org.apache.maven.surefire.booter.ProviderFactory.invokeProvider(ProviderFactory.java:85)
      	at org.apache.maven.surefire.booter.ForkedBooter.runSuitesInProcess(ForkedBooter.java:103)
      	at org.apache.maven.surefire.booter.ForkedBooter.main(ForkedBooter.java:74)
      should_add_pattern(org.jboss.forge.git.gitignore.GitIgnorePluginTest)  Time elapsed: 5.689 sec  <<< ERROR!
      java.lang.RuntimeException: failed to delete: C:\Users\GEORGE\AppData\Local\Temp\abstractshelltest68250029700420442.tmp\test\gibo\.git\objects\pack\pack-5b17fd52f6bc027884be4ab04f8edfb7a3e62e4c.pack
      	at org.jboss.forge.resources.FileResource._deleteRecursive(FileResource.java:260)
      	at org.jboss.forge.resources.FileResource._deleteRecursive(FileResource.java:254)
      	at org.jboss.forge.resources.FileResource._deleteRecursive(FileResource.java:254)
      	at org.jboss.forge.resources.FileResource._deleteRecursive(FileResource.java:254)
      	at org.jboss.forge.resources.FileResource._deleteRecursive(FileResource.java:254)
      	at org.jboss.forge.resources.FileResource._deleteRecursive(FileResource.java:254)
      	at org.jboss.forge.resources.FileResource.delete(FileResource.java:198)
      	at org.jboss.forge.test.AbstractShellTest.afterTest(AbstractShellTest.java:207)
      	at sun.reflect.NativeMethodAccessorImpl.invoke0(Native Method)
      	at sun.reflect.NativeMethodAccessorImpl.invoke(NativeMethodAccessorImpl.java:39)
      	at sun.reflect.DelegatingMethodAccessorImpl.invoke(DelegatingMethodAccessorImpl.java:25)
      	at java.lang.reflect.Method.invoke(Method.java:597)
      	at org.junit.runners.model.FrameworkMethod$1.runReflectiveCall(FrameworkMethod.java:44)
      	at org.junit.internal.runners.model.ReflectiveCallable.run(ReflectiveCallable.java:15)
      	at org.junit.runners.model.FrameworkMethod.invokeExplosively(FrameworkMethod.java:41)
      	at org.junit.internal.runners.statements.RunAfters.evaluate(RunAfters.java:37)
      	at org.jboss.arquillian.junit.Arquillian$StatementLifecycleExecutor.invoke(Arquillian.java:351)
      	at org.jboss.arquillian.container.test.impl.execution.ClientBeforeAfterLifecycleEventExecuter.execute(ClientBeforeAfterLifecycleEventExecuter.java:99)
      	at org.jboss.arquillian.container.test.impl.execution.ClientBeforeAfterLifecycleEventExecuter.on(ClientBeforeAfterLifecycleEventExecuter.java:80)
      	at sun.reflect.NativeMethodAccessorImpl.invoke0(Native Method)
      	at sun.reflect.NativeMethodAccessorImpl.invoke(NativeMethodAccessorImpl.java:39)
      	at sun.reflect.DelegatingMethodAccessorImpl.invoke(DelegatingMethodAccessorImpl.java:25)
      	at java.lang.reflect.Method.invoke(Method.java:597)
      	at org.jboss.arquillian.core.impl.ObserverImpl.invoke(ObserverImpl.java:90)
      	at org.jboss.arquillian.core.impl.EventContextImpl.invokeObservers(EventContextImpl.java:99)
      	at org.jboss.arquillian.core.impl.EventContextImpl.proceed(EventContextImpl.java:81)
      	at org.jboss.arquillian.testenricher.cdi.CreationalContextDestroyer.destory(CreationalContextDestroyer.java:44)
      	at sun.reflect.NativeMethodAccessorImpl.invoke0(Native Method)
      	at sun.reflect.NativeMethodAccessorImpl.invoke(NativeMethodAccessorImpl.java:39)
      	at sun.reflect.DelegatingMethodAccessorImpl.invoke(DelegatingMethodAccessorImpl.java:25)
      	at java.lang.reflect.Method.invoke(Method.java:597)
      	at org.jboss.arquillian.core.impl.ObserverImpl.invoke(ObserverImpl.java:90)
      	at org.jboss.arquillian.core.impl.EventContextImpl.proceed(EventContextImpl.java:88)
      	at org.jboss.arquillian.container.test.impl.client.ContainerEventController.createContext(ContainerEventController.java:142)
      	at org.jboss.arquillian.container.test.impl.client.ContainerEventController.createAfterContext(ContainerEventController.java:134)
      	at sun.reflect.NativeMethodAccessorImpl.invoke0(Native Method)
      	at sun.reflect.NativeMethodAccessorImpl.invoke(NativeMethodAccessorImpl.java:39)
      	at sun.reflect.DelegatingMethodAccessorImpl.invoke(DelegatingMethodAccessorImpl.java:25)
      	at java.lang.reflect.Method.invoke(Method.java:597)
      	at org.jboss.arquillian.core.impl.ObserverImpl.invoke(ObserverImpl.java:90)
      	at org.jboss.arquillian.core.impl.EventContextImpl.proceed(EventContextImpl.java:88)
      	at org.jboss.arquillian.test.impl.TestContextHandler.createTestContext(TestContextHandler.java:89)
      	at sun.reflect.NativeMethodAccessorImpl.invoke0(Native Method)
      	at sun.reflect.NativeMethodAccessorImpl.invoke(NativeMethodAccessorImpl.java:39)
      	at sun.reflect.DelegatingMethodAccessorImpl.invoke(DelegatingMethodAccessorImpl.java:25)
      	at java.lang.reflect.Method.invoke(Method.java:597)
      	at org.jboss.arquillian.core.impl.ObserverImpl.invoke(ObserverImpl.java:90)
      	at org.jboss.arquillian.core.impl.EventContextImpl.proceed(EventContextImpl.java:88)
      	at org.jboss.arquillian.test.impl.TestContextHandler.createClassContext(TestContextHandler.java:75)
      	at sun.reflect.NativeMethodAccessorImpl.invoke0(Native Method)
      	at sun.reflect.NativeMethodAccessorImpl.invoke(NativeMethodAccessorImpl.java:39)
      	at sun.reflect.DelegatingMethodAccessorImpl.invoke(DelegatingMethodAccessorImpl.java:25)
      	at java.lang.reflect.Method.invoke(Method.java:597)
      	at org.jboss.arquillian.core.impl.ObserverImpl.invoke(ObserverImpl.java:90)
      	at org.jboss.arquillian.core.impl.EventContextImpl.proceed(EventContextImpl.java:88)
      	at org.jboss.arquillian.test.impl.TestContextHandler.createSuiteContext(TestContextHandler.java:60)
      	at sun.reflect.GeneratedMethodAccessor52.invoke(Unknown Source)
      	at sun.reflect.DelegatingMethodAccessorImpl.invoke(DelegatingMethodAccessorImpl.java:25)
      	at java.lang.reflect.Method.invoke(Method.java:597)
      	at org.jboss.arquillian.core.impl.ObserverImpl.invoke(ObserverImpl.java:90)
      	at org.jboss.arquillian.core.impl.EventContextImpl.proceed(EventContextImpl.java:88)
      	at org.jboss.arquillian.core.impl.ManagerImpl.fire(ManagerImpl.java:134)
      	at org.jboss.arquillian.core.impl.ManagerImpl.fire(ManagerImpl.java:114)
      	at org.jboss.arquillian.test.impl.EventTestRunnerAdaptor.after(EventTestRunnerAdaptor.java:103)
      	at org.jboss.arquillian.junit.Arquillian$5$1.evaluate(Arquillian.java:245)
      	at org.jboss.arquillian.junit.Arquillian.multiExecute(Arquillian.java:314)
      	at org.jboss.arquillian.junit.Arquillian.access$100(Arquillian.java:46)
      	at org.jboss.arquillian.junit.Arquillian$5.evaluate(Arquillian.java:240)
      	at org.junit.runners.BlockJUnit4ClassRunner.runChild(BlockJUnit4ClassRunner.java:76)
      	at org.junit.runners.BlockJUnit4ClassRunner.runChild(BlockJUnit4ClassRunner.java:50)
      	at org.junit.runners.ParentRunner$3.run(ParentRunner.java:193)
      	at org.junit.runners.ParentRunner$1.schedule(ParentRunner.java:52)
      	at org.junit.runners.ParentRunner.runChildren(ParentRunner.java:191)
      	at org.junit.runners.ParentRunner.access$000(ParentRunner.java:42)
      	at org.junit.runners.ParentRunner$2.evaluate(ParentRunner.java:184)
      	at org.jboss.arquillian.junit.Arquillian$2.evaluate(Arquillian.java:185)
      	at org.jboss.arquillian.junit.Arquillian.multiExecute(Arquillian.java:314)
      	at org.jboss.arquillian.junit.Arquillian.access$100(Arquillian.java:46)
      	at org.jboss.arquillian.junit.Arquillian$3.evaluate(Arquillian.java:199)
      	at org.junit.runners.ParentRunner.run(ParentRunner.java:236)
      	at org.jboss.arquillian.junit.Arquillian.run(Arquillian.java:147)
      	at org.apache.maven.surefire.junit4.JUnit4Provider.execute(JUnit4Provider.java:236)
      	at org.apache.maven.surefire.junit4.JUnit4Provider.executeTestSet(JUnit4Provider.java:134)
      	at org.apache.maven.surefire.junit4.JUnit4Provider.invoke(JUnit4Provider.java:113)
      	at sun.reflect.NativeMethodAccessorImpl.invoke0(Native Method)
      	at sun.reflect.NativeMethodAccessorImpl.invoke(NativeMethodAccessorImpl.java:39)
      	at sun.reflect.DelegatingMethodAccessorImpl.invoke(DelegatingMethodAccessorImpl.java:25)
      	at java.lang.reflect.Method.invoke(Method.java:597)
      	at org.apache.maven.surefire.util.ReflectionUtils.invokeMethodWithArray(ReflectionUtils.java:189)
      	at org.apache.maven.surefire.booter.ProviderFactory$ProviderProxy.invoke(ProviderFactory.java:165)
      	at org.apache.maven.surefire.booter.ProviderFactory.invokeProvider(ProviderFactory.java:85)
      	at org.apache.maven.surefire.booter.ForkedBooter.runSuitesInProcess(ForkedBooter.java:103)
      	at org.apache.maven.surefire.booter.ForkedBooter.main(ForkedBooter.java:74)
      should_remove_pattern(org.jboss.forge.git.gitignore.GitIgnorePluginTest)  Time elapsed: 6.319 sec  <<< ERROR!
      java.lang.RuntimeException: failed to delete: C:\Users\GEORGE\AppData\Local\Temp\abstractshelltest6556064542936932428.tmp\test\gibo\.git\objects\pack\pack-5b17fd52f6bc027884be4ab04f8edfb7a3e62e4c.pack
      	at org.jboss.forge.resources.FileResource._deleteRecursive(FileResource.java:260)
      	at org.jboss.forge.resources.FileResource._deleteRecursive(FileResource.java:254)
      	at org.jboss.forge.resources.FileResource._deleteRecursive(FileResource.java:254)
      	at org.jboss.forge.resources.FileResource._deleteRecursive(FileResource.java:254)
      	at org.jboss.forge.resources.FileResource._deleteRecursive(FileResource.java:254)
      	at org.jboss.forge.resources.FileResource._deleteRecursive(FileResource.java:254)
      	at org.jboss.forge.resources.FileResource.delete(FileResource.java:198)
      	at org.jboss.forge.test.AbstractShellTest.afterTest(AbstractShellTest.java:207)
      	at sun.reflect.NativeMethodAccessorImpl.invoke0(Native Method)
      	at sun.reflect.NativeMethodAccessorImpl.invoke(NativeMethodAccessorImpl.java:39)
      	at sun.reflect.DelegatingMethodAccessorImpl.invoke(DelegatingMethodAccessorImpl.java:25)
      	at java.lang.reflect.Method.invoke(Method.java:597)
      	at org.junit.runners.model.FrameworkMethod$1.runReflectiveCall(FrameworkMethod.java:44)
      	at org.junit.internal.runners.model.ReflectiveCallable.run(ReflectiveCallable.java:15)
      	at org.junit.runners.model.FrameworkMethod.invokeExplosively(FrameworkMethod.java:41)
      	at org.junit.internal.runners.statements.RunAfters.evaluate(RunAfters.java:37)
      	at org.jboss.arquillian.junit.Arquillian$StatementLifecycleExecutor.invoke(Arquillian.java:351)
      	at org.jboss.arquillian.container.test.impl.execution.ClientBeforeAfterLifecycleEventExecuter.execute(ClientBeforeAfterLifecycleEventExecuter.java:99)
      	at org.jboss.arquillian.container.test.impl.execution.ClientBeforeAfterLifecycleEventExecuter.on(ClientBeforeAfterLifecycleEventExecuter.java:80)
      	at sun.reflect.NativeMethodAccessorImpl.invoke0(Native Method)
      	at sun.reflect.NativeMethodAccessorImpl.invoke(NativeMethodAccessorImpl.java:39)
      	at sun.reflect.DelegatingMethodAccessorImpl.invoke(DelegatingMethodAccessorImpl.java:25)
      	at java.lang.reflect.Method.invoke(Method.java:597)
      	at org.jboss.arquillian.core.impl.ObserverImpl.invoke(ObserverImpl.java:90)
      	at org.jboss.arquillian.core.impl.EventContextImpl.invokeObservers(EventContextImpl.java:99)
      	at org.jboss.arquillian.core.impl.EventContextImpl.proceed(EventContextImpl.java:81)
      	at org.jboss.arquillian.testenricher.cdi.CreationalContextDestroyer.destory(CreationalContextDestroyer.java:44)
      	at sun.reflect.NativeMethodAccessorImpl.invoke0(Native Method)
      	at sun.reflect.NativeMethodAccessorImpl.invoke(NativeMethodAccessorImpl.java:39)
      	at sun.reflect.DelegatingMethodAccessorImpl.invoke(DelegatingMethodAccessorImpl.java:25)
      	at java.lang.reflect.Method.invoke(Method.java:597)
      	at org.jboss.arquillian.core.impl.ObserverImpl.invoke(ObserverImpl.java:90)
      	at org.jboss.arquillian.core.impl.EventContextImpl.proceed(EventContextImpl.java:88)
      	at org.jboss.arquillian.container.test.impl.client.ContainerEventController.createContext(ContainerEventController.java:142)
      	at org.jboss.arquillian.container.test.impl.client.ContainerEventController.createAfterContext(ContainerEventController.java:134)
      	at sun.reflect.NativeMethodAccessorImpl.invoke0(Native Method)
      	at sun.reflect.NativeMethodAccessorImpl.invoke(NativeMethodAccessorImpl.java:39)
      	at sun.reflect.DelegatingMethodAccessorImpl.invoke(DelegatingMethodAccessorImpl.java:25)
      	at java.lang.reflect.Method.invoke(Method.java:597)
      	at org.jboss.arquillian.core.impl.ObserverImpl.invoke(ObserverImpl.java:90)
      	at org.jboss.arquillian.core.impl.EventContextImpl.proceed(EventContextImpl.java:88)
      	at org.jboss.arquillian.test.impl.TestContextHandler.createTestContext(TestContextHandler.java:89)
      	at sun.reflect.GeneratedMethodAccessor56.invoke(Unknown Source)
      	at sun.reflect.DelegatingMethodAccessorImpl.invoke(DelegatingMethodAccessorImpl.java:25)
      	at java.lang.reflect.Method.invoke(Method.java:597)
      	at org.jboss.arquillian.core.impl.ObserverImpl.invoke(ObserverImpl.java:90)
      	at org.jboss.arquillian.core.impl.EventContextImpl.proceed(EventContextImpl.java:88)
      	at org.jboss.arquillian.test.impl.TestContextHandler.createClassContext(TestContextHandler.java:75)
      	at sun.reflect.GeneratedMethodAccessor55.invoke(Unknown Source)
      	at sun.reflect.DelegatingMethodAccessorImpl.invoke(DelegatingMethodAccessorImpl.java:25)
      	at java.lang.reflect.Method.invoke(Method.java:597)
      	at org.jboss.arquillian.core.impl.ObserverImpl.invoke(ObserverImpl.java:90)
      	at org.jboss.arquillian.core.impl.EventContextImpl.proceed(EventContextImpl.java:88)
      	at org.jboss.arquillian.test.impl.TestContextHandler.createSuiteContext(TestContextHandler.java:60)
      	at sun.reflect.GeneratedMethodAccessor52.invoke(Unknown Source)
      	at sun.reflect.DelegatingMethodAccessorImpl.invoke(DelegatingMethodAccessorImpl.java:25)
      	at java.lang.reflect.Method.invoke(Method.java:597)
      	at org.jboss.arquillian.core.impl.ObserverImpl.invoke(ObserverImpl.java:90)
      	at org.jboss.arquillian.core.impl.EventContextImpl.proceed(EventContextImpl.java:88)
      	at org.jboss.arquillian.core.impl.ManagerImpl.fire(ManagerImpl.java:134)
      	at org.jboss.arquillian.core.impl.ManagerImpl.fire(ManagerImpl.java:114)
      	at org.jboss.arquillian.test.impl.EventTestRunnerAdaptor.after(EventTestRunnerAdaptor.java:103)
      	at org.jboss.arquillian.junit.Arquillian$5$1.evaluate(Arquillian.java:245)
      	at org.jboss.arquillian.junit.Arquillian.multiExecute(Arquillian.java:314)
      	at org.jboss.arquillian.junit.Arquillian.access$100(Arquillian.java:46)
      	at org.jboss.arquillian.junit.Arquillian$5.evaluate(Arquillian.java:240)
      	at org.junit.runners.BlockJUnit4ClassRunner.runChild(BlockJUnit4ClassRunner.java:76)
      	at org.junit.runners.BlockJUnit4ClassRunner.runChild(BlockJUnit4ClassRunner.java:50)
      	at org.junit.runners.ParentRunner$3.run(ParentRunner.java:193)
      	at org.junit.runners.ParentRunner$1.schedule(ParentRunner.java:52)
      	at org.junit.runners.ParentRunner.runChildren(ParentRunner.java:191)
      	at org.junit.runners.ParentRunner.access$000(ParentRunner.java:42)
      	at org.junit.runners.ParentRunner$2.evaluate(ParentRunner.java:184)
      	at org.jboss.arquillian.junit.Arquillian$2.evaluate(Arquillian.java:185)
      	at org.jboss.arquillian.junit.Arquillian.multiExecute(Arquillian.java:314)
      	at org.jboss.arquillian.junit.Arquillian.access$100(Arquillian.java:46)
      	at org.jboss.arquillian.junit.Arquillian$3.evaluate(Arquillian.java:199)
      	at org.junit.runners.ParentRunner.run(ParentRunner.java:236)
      	at org.jboss.arquillian.junit.Arquillian.run(Arquillian.java:147)
      	at org.apache.maven.surefire.junit4.JUnit4Provider.execute(JUnit4Provider.java:236)
      	at org.apache.maven.surefire.junit4.JUnit4Provider.executeTestSet(JUnit4Provider.java:134)
      	at org.apache.maven.surefire.junit4.JUnit4Provider.invoke(JUnit4Provider.java:113)
      	at sun.reflect.NativeMethodAccessorImpl.invoke0(Native Method)
      	at sun.reflect.NativeMethodAccessorImpl.invoke(NativeMethodAccessorImpl.java:39)
      	at sun.reflect.DelegatingMethodAccessorImpl.invoke(DelegatingMethodAccessorImpl.java:25)
      	at java.lang.reflect.Method.invoke(Method.java:597)
      	at org.apache.maven.surefire.util.ReflectionUtils.invokeMethodWithArray(ReflectionUtils.java:189)
      	at org.apache.maven.surefire.booter.ProviderFactory$ProviderProxy.invoke(ProviderFactory.java:165)
      	at org.apache.maven.surefire.booter.ProviderFactory.invokeProvider(ProviderFactory.java:85)
      	at org.apache.maven.surefire.booter.ForkedBooter.runSuitesInProcess(ForkedBooter.java:103)
      	at org.apache.maven.surefire.booter.ForkedBooter.main(ForkedBooter.java:74)
      

        Gliffy Diagrams

          Attachments

            Activity

              People

              • Assignee:
                gastaldi George Gastaldi
                Reporter:
                gastaldi George Gastaldi
              • Votes:
                0 Vote for this issue
                Watchers:
                2 Start watching this issue

                Dates

                • Created:
                  Updated:
                  Resolved: