Details

    • Type: Bug
    • Status: Closed (View Workflow)
    • Priority: Major
    • Resolution: Done
    • Affects Version/s: None
    • Fix Version/s: 0.6.0.Final
    • Component/s: None
    • Labels:
      None

      Description

      Tests run: 5, Failures: 0, Errors: 1, Skipped: 0, Time elapsed: 58.193 sec <<< FAILURE!
      testWagonPull(org.overlord.sramp.test.wagon.SrampWagonTest) Time elapsed: 1.402 sec <<< ERROR!
      java.lang.NullPointerException: null
      at java.lang.String.concat(String.java:1970)
      at org.codehaus.plexus.logging.console.ConsoleLogger.log(ConsoleLogger.java:91)
      at org.codehaus.plexus.logging.console.ConsoleLogger.error(ConsoleLogger.java:68)
      at org.overlord.sramp.wagon.SrampWagon.error(SrampWagon.java:992)
      at org.overlord.sramp.wagon.SrampWagon.doGetArtifact(SrampWagon.java:491)
      at org.overlord.sramp.wagon.SrampWagon.fillInputData(SrampWagon.java:224)
      at org.apache.maven.wagon.StreamWagon.getInputStream(StreamWagon.java:116)
      at org.apache.maven.wagon.StreamWagon.getIfNewer(StreamWagon.java:88)
      at org.apache.maven.wagon.StreamWagon.get(StreamWagon.java:61)
      at org.overlord.sramp.test.wagon.SrampWagonTest.testWagonPull(SrampWagonTest.java:351)

      Running org.overlord.sramp.test.server.atom.services.OntologyResourceTest
      Tests run: 4, Failures: 0, Errors: 0, Skipped: 0, Time elapsed: 1.866 sec
      Running org.overlord.sramp.test.server.atom.services.ServiceDocumentResourceTest
      Tests run: 1, Failures: 0, Errors: 0, Skipped: 0, Time elapsed: 0.115 sec
      Running org.overlord.sramp.test.server.atom.services.QueryResourceTest
      Tests run: 3, Failures: 0, Errors: 0, Skipped: 0, Time elapsed: 32.207 sec
      Running org.overlord.sramp.test.server.atom.services.AuditResourceTest
      Tests run: 2, Failures: 0, Errors: 0, Skipped: 0, Time elapsed: 1.733 sec
      Running org.overlord.sramp.test.server.atom.services.BatchResourceTest
      Tests run: 2, Failures: 0, Errors: 0, Skipped: 0, Time elapsed: 10.549 sec
      Running org.overlord.sramp.test.server.atom.services.ArtifactResourceTest
      Tests run: 12, Failures: 0, Errors: 1, Skipped: 0, Time elapsed: 9.969 sec <<< FAILURE!
      testFullPurchaseOrderXSD(org.overlord.sramp.test.server.atom.services.ArtifactResourceTest) Time elapsed: 1.873 sec <<< ERROR!
      java.lang.NullPointerException: null
      at org.overlord.sramp.common.SrampModelUtils.getCustomProperty(SrampModelUtils.java:97)
      at org.overlord.sramp.test.server.atom.services.ArtifactResourceTest.verifyEntryUpdated(ArtifactResourceTest.java:736)
      at org.overlord.sramp.test.server.atom.services.ArtifactResourceTest.testFullPurchaseOrderXSD(ArtifactResourceTest.java:611)

        Gliffy Diagrams

          Attachments

            Activity

              People

              • Assignee:
                virchete David virgil naranjo
                Reporter:
                virchete David virgil naranjo
              • Votes:
                0 Vote for this issue
                Watchers:
                1 Start watching this issue

                Dates

                • Created:
                  Updated:
                  Resolved: